{"text_format":"1","workbook":"xlsx","n_sheets":17,"sheets":["Revision Info","T1003 S2","T1004 S2","T2910 S2","R1102 S2","R1104 S2","R1104 S2 NAS","R2108 S2","R2208 S2","R2208 S3","R2210 S2","R2216 S3","W1900 S2","W2904 S2","NUC S3","DAVIDE","DAVIDE Tiny"],"not_rendered":{"charts":0,"images":48,"macros":1,"external_links":1,"defined_names":0,"comments":15,"pivot_tables":0},"unopened":[],"bounds":{"document_bytes":16777216,"sheet_cells":100000,"rows_first":2000,"rows_last":500,"rows_between":2000,"halvings":0,"cell_chars":16384,"cell_head_chars":4096},"cells_cut":0,"cells_raw":0,"read":"whole","date_system":"1900"}

{"sheet":"Revision Info","index":0,"n_rows":19,"n_cols":11,"rows_kept":19,"cut":false,"hidden":false,"merged":[]}
[]
[null,null,null,"GRAFENTHAL® Server Konfigurator"]
[]
[null,null,null,null,null,null,{"$f":"TODAY()","v":"2019-08-01"}]
[]
[]
["Angebot freibleibend"]
["Irrtümer vorbehalten"]
["Fehlerhafte Programmierungen oder Einstellungen können dem Service mitgeteilt werden"]
["Version","Revision 15"]
["Datum","2019-08-01"]
["Firmenanschrift GRAFENTHAL",null,null,"Logistik, Service und Distribution",null,null,"E- Mail Adressen"]
["GRAFENTHAL GmbH",null,null,"macle GmbH",null,null,"Allgemeine Anfragen & Support:",null,null,null,"info@grafenthal.de"]
["von Monschaw Strasse 3",null,null,"von-Monschaw-Strasse 3"]
["47574 Goch - Germany",null,null,"47574 Goch - Germany",null,null,"Ansprechpartner:"]
["Tel. 02823-4190-401",null,null,"Tel. 02823-4190-0",null,null,"CEO GRAFENTHAL",null,"Andreas De Matteis",null,"dematteis@grafenthal.de"]
["Fax. 02823-4190-400",null,null,"Fax. 02823-4190-100",null,null,"Server & Storage Service",null,"Pierre van Bergerem",null,"vanbergerem@macle.de"]
["info@grafenthal.de",null,null,"Email: info@macle.de",null,null,"RMA",null,"Kai Schmidt",null,"rma@macle.de"]
["www.grafenthal.de",null,null,"www.macle.com",null,null,"Partnerbetreuung DE: ",null,"Detlef Wanitzek",null,"wanitzek@grafenthal.de"]

{"sheet":"T1003 S2","index":1,"n_rows":163,"n_cols":29,"rows_kept":163,"cut":false,"hidden":false,"merged":[[0,4,0,8]]}
[null,null,null,null,"SFF Tower T1003 S2"]
[]
[null,null,null,null,null,null,null,"Intel® Xeon® E3-1200 v5 Produktfamilie","more Info"]
[null,null,null,null,null,null,null,"bis 64GB DDR4 ECC RAM Arbeitsspeicher"]
[null,null,null,null,null,null,null,"max. 60 TB Festplattenspeicher"]
[null,null,null,null,null,null,null,"RAID 0, 1, 5 und 10"]
[null,null,null,null,null,null,null,"M.2 NVMe-SSD Option","* Felder werden automatisch ausgefüllt"]
[null,null,null,null,null,null,null,"Dual Gigabit Ethernet","*) \"Menge\" filtern um Konfiguration anzuzeigen"]
[]
[]
[null,null,null,null,"Konfigurator",null,{"$f":"'Revision Info'!B10","v":"Revision 15"}]
[null,null,null,null,"ART. NR.","Menge\n    *)","Bezeichnung","Bezeichnung II","Bezeichnung III","nicht kombinierbar","nicht konfigurierbar","CPU Slots","MEM Slots","SSD Slots","HDD Slots HS 2.5","HDD Slots HS 3.5","HDD Slots HS SAS","HDD Slots HS SATA","HDD Slots NHS SAS","HDD Slots NHS SATA","SAS Ports","Int HDD Slots","3,5 Slots","5,25 Slots","PCI x1 Slots","PCI x4 Slots","PCI x8 Slots","PCI x16 Slots","DVD Slot"]
[null,null,null,null,"Maschinentyp",{"$f":"SUM(F14:F14)","v":0},null,null,null,"if (Kombi);-1;0","if Menge;-1;0","(Menge x Eigenschaft)","(Menge x Eigenschaft)","(Menge x Eigenschaft)","(Menge x Eigenschaft)","(Menge x Eigenschaft)","(Menge x Eigenschaft)","(Menge x Eigenschaft)","(Menge x Eigenschaft)","(Menge x Eigenschaft)","(Menge x Eigenschaft)","(Menge x Eigenschaft)","(Menge x Eigenschaft)","(Menge x Eigenschaft)","(Menge x Eigenschaft)","(Menge x Eigenschaft)","(Menge x Eigenschaft)","(Menge x Eigenschaft)","(Menge x Eigenschaft)"]
[null,null,null,null,"621G6002",0,"GRAFENTHAL CTO TOWER SERVER T1003 S2","C236 E3-1200V6  SOCKET DUAL GBIT","2x5,25\\ MEDIA BAYS 350W GOLD PSU\"",null,null,{"$f":"Tabelle1[[#This Row],[Menge\n    *)]]*1","v":0},{"$f":"Tabelle1[[#This Row],[Menge\n    *)]]*4","v":0},{"$f":"Tabelle1[[#This Row],[Menge\n    *)]]*0","v":0},{"$f":"Tabelle1[[#This Row],[Menge\n    *)]]*0","v":0},{"$f":"Tabelle1[[#This Row],[Menge\n    *)]]*0","v":0},{"$f":"Tabelle1[[#This Row],[Menge\n    *)]]*0","v":0},{"$f":"Tabelle1[[#This Row],[Menge\n    *)]]*0","v":0},{"$f":"Tabelle1[[#This Row],[Menge\n    *)]]*3","v":0},{"$f":"Tabelle1[[#This Row],[Menge\n    *)]]*3","v":0},{"$f":"Tabelle1[[#This Row],[Menge\n    *)]]*0","v":0},{"$f":"Tabelle1[[#This Row],[Menge\n    *)]]*3","v":0},{"$f":"Tabelle1[[#This Row],[Menge\n    *)]]*3","v":0},{"$f":"Tabelle1[[#This Row],[Menge\n    *)]]*2","v":0},{"$f":"Tabelle1[[#This Row],[Menge\n    *)]]*4","v":0},{"$f":"Tabelle1[[#This Row],[Menge\n    *)]]*3","v":0},{"$f":"Tabelle1[[#This Row],[Menge\n    *)]]*2","v":0},{"$f":"Tabelle1[[#This Row],[Menge\n    *)]]*1","v":0},{"$f":"Tabelle1[[#This Row],[Menge\n    *)]]*0","v":0}]
[null,null,null,null,"Prozessor",{"$f":"SUM(F16:F22)","v":0}]
[null,null,null,null,"656G8000",0,"GRAFENTHAL CPU XEON E3-1220v6 3.00GHz 4C","8MB 72W"," ",null,null,{"$f":"Tabelle1[[#This Row],[Menge\n    *)]]*-1","v":0},"X","X","X","X","X","X","X","X","X","X","X","X","X","X","X","X","X"]
[null,null,null,null,"656G8001",0,"GRAFENTHAL CPU XEON E3-1230v6 3.50GHz 4C","8MB 72W"," ",null,null,{"$f":"Tabelle1[[#This Row],[Menge\n    *)]]*-1","v":0},"X","X","X","X","X","X","X","X","X","X","X","X","X","X","X","X","X"]
[null,null,null,null,"656G8002",0,"GRAFENTHAL CPU XEON E3-1240v6 3.70GHz 4C","8MB 72W"," ",null,null,{"$f":"Tabelle1[[#This Row],[Menge\n    *)]]*-1","v":0},"X","X","X","X","X","X","X","X","X","X","X","X","X","X","X","X","X"]
[null,null,null,null,"656G8003",0,"GRAFENTHAL CPU XEON E3-1245v6 3.70GHz 4C","8MB 73W INTEL HD GRAPHICS P630"," ",null,null,{"$f":"Tabelle1[[#This Row],[Menge\n    *)]]*-1","v":0},"X","X","X","X","X","X","X","X","X","X","X","X","X","X","X","X","X"]
[null,null,null,null,"656G8004",0,"GRAFENTHAL CPU XEON E3-1270v6 3.80GHz 4C","8MB 72W"," ",null,null,{"$f":"Tabelle1[[#This Row],[Menge\n    *)]]*-1","v":0},"X","X","X","X","X","X","X","X","X","X","X","X","X","X","X","X","X"]
[null,null,null,null,"656G8005",0,"GRAFENTHAL CPU XEON E3-1275v6 3.80GHz 4C","8MB 73W INTEL HD GRAPHICS P630"," ",null,null,{"$f":"Tabelle1[[#This Row],[Menge\n    *)]]*-1","v":0},"X","X","X","X","X","X","X","X","X","X","X","X","X","X","X","X","X"]
[null,null,null,null,"656G8006",0,"GRAFENTHAL CPU XEON E3-1280v6 3.90GHz 4C","8MB 72W"," ",null,null,{"$f":"Tabelle1[[#This Row],[Menge\n    *)]]*-1","v":0},"X","X","X","X","X","X","X","X","X","X","X","X","X","X","X","X","X"]
[null,null,null,null,"Arbeitsspeicher",{"$f":"SUM(F24:F25)","v":0},"*Speicher dürfen nicht gemischt werden*"]
[null,null,null,null,"652G7004",0,"GRAFENTHAL MEM 8GB DDR4-2400MHz UDIMM","PC4-19200 CL17 DUAL RANKED ECC"," ",{"$f":"IF(COUNTIF(F24:F25,\">0\")>1,-1,0)","v":0},null,null,{"$f":"Tabelle1[[#This Row],[Menge\n    *)]]*-1","v":0}]
[null,null,null,null,"652G7005",0,"GRAFENTHAL MEM 16GB DDR4-2400MHz UDIMM","PC4-19200 CL17 DUAL RANKED ECC"," ",null,null,"X",{"$f":"Tabelle1[[#This Row],[Menge\n    *)]]*-1","v":0},"X","X","X","X","X","X","X","X","X","X","X","X","X","X","X","X"]
[null,null,null,null,"HDD Bays ",{"$f":"SUM(F27:F33)","v":0}]
[null,null,null,null,"657G6002",0,"GRAFENTHAL 2x 5,25'' 3x 3,5'' HOT SWAP","BAY EXPANSION UNIT","FOR SAS AND SATA HDD / SSD 12GB",null,null,"X","X",{"$f":"Tabelle1[[#This Row],[Menge\n    *)]]*3","v":0},{"$f":"Tabelle1[[#This Row],[Menge\n    *)]]*3","v":0},{"$f":"Tabelle1[[#This Row],[Menge\n    *)]]*3","v":0},{"$f":"Tabelle1[[#This Row],[Menge\n    *)]]*3","v":0},{"$f":"Tabelle1[[#This Row],[Menge\n    *)]]*3","v":0},"X","X","X","X","X",{"$f":"Tabelle1[[#This Row],[Menge\n    *)]]*-2","v":0},"X","X","X","X","X"]
[null,null,null,null,"657G5004",0,"GRAFENTHAL 2 x 2,5'' HDD / SSD","EXPANSION UNIT 1 x SLIM OPTICAL DRIVE","SATA3 6GB  5,25'' SIZE",null,null,"X","X",{"$f":"Tabelle1[[#This Row],[Menge\n    *)]]*2","v":0},{"$f":"Tabelle1[[#This Row],[Menge\n    *)]]*2","v":0},"X",{"$f":"Tabelle1[[#This Row],[Menge\n    *)]]*2","v":0},{"$f":"Tabelle1[[#This Row],[Menge\n    *)]]*2","v":0},"X","X","X","X","X",{"$f":"Tabelle1[[#This Row],[Menge\n    *)]]*-1","v":0},"X","X","X","X",{"$f":"Tabelle1[[#This Row],[Menge\n    *)]]*1","v":0}]
[null,null,null,null,"657G5006",0,"GRAFENTHAL 4 x 2,5'' HOT SWAP BAY","EXPANSION UNIT FOR SAS AND SATA","HDD/SSD",null,null,"X","X",{"$f":"Tabelle1[[#This Row],[Menge\n    *)]]*4","v":0},{"$f":"Tabelle1[[#This Row],[Menge\n    *)]]*4","v":0},"X",{"$f":"Tabelle1[[#This Row],[Menge\n    *)]]*4","v":0},{"$f":"Tabelle1[[#This Row],[Menge\n    *)]]*4","v":0},"X","X","X","X","X",{"$f":"Tabelle1[[#This Row],[Menge\n    *)]]*-1","v":0},"X","X","X","X","X"]
[null,null,null,null,"657G5005",0,"GRAFENTHAL 6 x 2,5'' HS HDD EXPANSION","UNIT SATA ONLY SATA3 6GB  5,25'' SIZE"," ",null,null,"X","X",{"$f":"Tabelle1[[#This Row],[Menge\n    *)]]*6","v":0},"X","X",{"$f":"Tabelle1[[#This Row],[Menge\n    *)]]*0","v":0},{"$f":"Tabelle1[[#This Row],[Menge\n    *)]]*6","v":0},"X","X","X","X","X",{"$f":"Tabelle1[[#This Row],[Menge\n    *)]]*-1","v":0},"X","X","X","X","X"]
[null,null,null,null,"657G6003",0,"GRAFENTHAL BACKUP TO DISK KIT 2TB HDD","HOT SWAP BAY HDD TRANSPORT CASE"," ",null,null,"X","X","X","X","X","X","X",{"$f":"Tabelle1[[#This Row],[Menge\n    *)]]*1","v":0},"X","X",{"$f":"Tabelle1[[#This Row],[Menge\n    *)]]*-1","v":0},{"$f":"Tabelle1[[#This Row],[Menge\n    *)]]*-1","v":0},"X","X","X","X","X","X"]
[null,null,null,null,"657G6004",0,"GRAFENTHAL BACKUP TO DISK 2TB","HDD ADDITIONAL DISK"," ",null,null,"X","X","X","X","X","X","X","X","X","X",{"$f":"Tabelle1[[#This Row],[Menge\n    *)]]*3","v":0},"X","X","X","X","X","X","X"]
[null,null,null,null,"659G6001",{"$f":"F29+F30+F28+F31","v":0},"GRAFENTHAL POWER SUPPLY CABLE 20CM SATA","15-PIN SATA POWER 2x 4PIN"," ",null,null,"X","X","X","X","X","X","X","X","X","X","X","X","X","X","X","X","X","X"]
[null,null,null,null,"HDD Hot Swap",{"$f":"SUM(F35:F71)","v":0}]
[null,null,null,null,"SATA SSD 6GB/s *MIDRANGE*",{"$f":"SUM(F36:F37)","v":0}]
[null,null,null,null,"651G7011",0,"GRAFENTHAL SSD 240GB 2.5'' SATA 6GB/S","MIDRANGE 599 TBW"," ",null,null,"X","X",{"$f":"Tabelle1[[#This Row],[Menge\n    *)]]*-1","v":0},"X","X","X",{"$f":"Tabelle1[[#This Row],[Menge\n    *)]]*-1","v":0},"X","X","X","X","X","X","X","X","X","X","X"]
[null,null,null,null,"651G7012",0,"GRAFENTHAL SSD 480GB 2.5'' SATA 6GB/S","MIDRANGE 945 TBW"," ",null,null,"X","X",{"$f":"Tabelle1[[#This Row],[Menge\n    *)]]*-1","v":0},"X","X","X",{"$f":"Tabelle1[[#This Row],[Menge\n    *)]]*-1","v":0},"X","X","X","X","X","X","X","X","X","X","X"]
[null,null,null,null,"SATA SSD 6GB/s *ENTRY*",{"$f":"SUM(F39:F42)","v":0}]
[null,null,null,null,"651G8024",0,"GRAFENTHAL SSD 256GB SATA3 6GB/S 2.5''","MTBF 1.5M HOURS TBW 300TB"," ",null,null,"X","X",{"$f":"Tabelle1[[#This Row],[Menge\n    *)]]*-1","v":0},"X","X","X",{"$f":"Tabelle1[[#This Row],[Menge\n    *)]]*-1","v":0},"X","X","X","X","X","X","X","X","X","X","X"]
[null,null,null,null,"651G8025",0,"GRAFENTHAL SSD 512GB SATA3 6GB/S 2.5''","MTBF 1.5M HOURS TBW 300TB"," ",null,null,"X","X",{"$f":"Tabelle1[[#This Row],[Menge\n    *)]]*0","v":0},"X","X","X",{"$f":"Tabelle1[[#This Row],[Menge\n    *)]]*0","v":0},"X","X","X","X","X","X","X","X","X","X","X"]
[null,null,null,null,"651G8026",0,"GRAFENTHAL SSD 1TB SATA3 6GB/S 2.5''","MTBF 1.5M HOURS TBW 300TB"," ",null,null,"X","X",{"$f":"Tabelle1[[#This Row],[Menge\n    *)]]*-1","v":0},"X","X","X",{"$f":"Tabelle1[[#This Row],[Menge\n    *)]]*-1","v":0},"X","X","X","X","X","X","X","X","X","X","X"]
[null,null,null,null,"651G8027",0,"GRAFENTHAL SSD 2TB SATA3 6GB/S 2.5''","MTBF 1.5M HOURS TBW 300TB"," ",null,null,"X","X",{"$f":"Tabelle1[[#This Row],[Menge\n    *)]]*0","v":0},"X","X","X",{"$f":"Tabelle1[[#This Row],[Menge\n    *)]]*0","v":0},"X","X","X","X","X","X","X","X","X","X","X"]
[null,null,null,null,"SATA HDD 6GB/s",{"$f":"SUM(F44)","v":0}]
[null,null,null,null,"651G6002",0,"GRAFENTHAL HDD 1TB 2,5'' SATA 7200RPM","32MB CACHE 6GB/S BAUHÖHE 9.5MM","FUER SERVER UND WORKSTATION",null,null,"X","X",{"$f":"Tabelle1[[#This Row],[Menge\n    *)]]*-1","v":0},{"$f":"Tabelle1[[#This Row],[Menge\n    *)]]*-1","v":0},"X","X",{"$f":"Tabelle1[[#This Row],[Menge\n    *)]]*-1","v":0},"X","X","X","X","X","X","X","X","X","X","X"]
[null,null,null,null,"SATA 3,5\" 7,2k 6GB/s",{"$f":"SUM(F46:F49)","v":0}]
[null,null,null,null,"651G6022",0,"HDD 6TB S-ATA 7,2K 3,5“ 6GB/S 24/7","FOR GRAFENTHAL SERVER","MTTF 2.0M HOURS",null,null,"X","X",{"$f":"Tabelle1[[#This Row],[Menge\n    *)]]*-1","v":0},{"$f":"Tabelle1[[#This Row],[Menge\n    *)]]*-1","v":0},{"$f":"Tabelle1[[#This Row],[Menge\n    *)]]*-1","v":0},"X",{"$f":"Tabelle1[[#This Row],[Menge\n    *)]]*-1","v":0},"X","X","X","X","X","X","X","X","X","X","X"]
[null,null,null,null,"651G6023",0,"GRAFENTHAL HDD 4TB S-ATA 7,2K 3,5“","6GB/S 24/7","MTTF 2.0M HOURS",null,null,"X","X",{"$f":"Tabelle1[[#This Row],[Menge\n    *)]]*-1","v":0},{"$f":"Tabelle1[[#This Row],[Menge\n    *)]]*-1","v":0},{"$f":"Tabelle1[[#This Row],[Menge\n    *)]]*-1","v":0},"X",{"$f":"Tabelle1[[#This Row],[Menge\n    *)]]*-1","v":0},"X","X","X","X","X","X","X","X","X","X","X"]
[null,null,null,null,"651G6024",0,"HDD 2TB S-ATA 7,2K 3,5“ 6GB/S 24/7","FOR GRAFENTHAL SERVER","MTTF 2.0M HOURS",null,null,"X","X",{"$f":"Tabelle1[[#This Row],[Menge\n    *)]]*-1","v":0},{"$f":"Tabelle1[[#This Row],[Menge\n    *)]]*-1","v":0},{"$f":"Tabelle1[[#This Row],[Menge\n    *)]]*-1","v":0},"X",{"$f":"Tabelle1[[#This Row],[Menge\n    *)]]*-1","v":0},"X","X","X","X","X","X","X","X","X","X","X"]
[null,null,null,null,"651G6025",0,"HDD 10TB S-ATA 7,2K 3,5“ 6GB/S 24/7","FOR GRAFENTHAL SERVER","MTTF 2.0M HOURS",null,null,"X","X",{"$f":"Tabelle1[[#This Row],[Menge\n    *)]]*-1","v":0},{"$f":"Tabelle1[[#This Row],[Menge\n    *)]]*-1","v":0},{"$f":"Tabelle1[[#This Row],[Menge\n    *)]]*-1","v":0},"X",{"$f":"Tabelle1[[#This Row],[Menge\n    *)]]*-1","v":0},"X","X","X","X","X","X","X","X","X","X","X"]
[null,null,null,null,"SAS 2,5\" 10k 12GB/s",{"$f":"SUM(F51:F55)","v":0}]
[null,null,null,null,"651G8020",0,"GRAFENTHAL HDD 300GB 10K 2.5'' SAS","12GB/S"," ",null,null,"X","X",{"$f":"Tabelle1[[#This Row],[Menge\n    *)]]*-1","v":0},{"$f":"Tabelle1[[#This Row],[Menge\n    *)]]*-1","v":0},"X",{"$f":"Tabelle1[[#This Row],[Menge\n    *)]]*-1","v":0},{"$f":"Tabelle1[[#This Row],[Menge\n    *)]]*-1","v":0},"X","X",{"$f":"Tabelle1[[#This Row],[Menge\n    *)]]*-1","v":0},"X","X","X","X","X","X","X","X"]
[null,null,null,null,"651G8005",0,"GRAFENTHAL HDD 600GB 10K 2.5\\ SAS 12GB/S\""," "," ",null,null,"X","X",{"$f":"Tabelle1[[#This Row],[Menge\n    *)]]*-1","v":0},{"$f":"Tabelle1[[#This Row],[Menge\n    *)]]*-1","v":0},"X",{"$f":"Tabelle1[[#This Row],[Menge\n    *)]]*-1","v":0},{"$f":"Tabelle1[[#This Row],[Menge\n    *)]]*-1","v":0},"X","X",{"$f":"Tabelle1[[#This Row],[Menge\n    *)]]*-1","v":0},"X","X","X","X","X","X","X","X"]
[null,null,null,null,"651G8006",0,"GRAFENTHAL HDD 900GB 10K 2.5\\ SAS 12GB/S\""," "," ",null,null,"X","X",{"$f":"Tabelle1[[#This Row],[Menge\n    *)]]*-1","v":0},{"$f":"Tabelle1[[#This Row],[Menge\n    *)]]*-1","v":0},"X",{"$f":"Tabelle1[[#This Row],[Menge\n    *)]]*-1","v":0},{"$f":"Tabelle1[[#This Row],[Menge\n    *)]]*-1","v":0},"X","X",{"$f":"Tabelle1[[#This Row],[Menge\n    *)]]*-1","v":0},"X","X","X","X","X","X","X","X"]
[null,null,null,null,"651G8007",0,"GRAFENTHAL HDD 1.2TB 10K 2.5\\ SAS 12GB/S\""," "," ",null,null,"X","X",{"$f":"Tabelle1[[#This Row],[Menge\n    *)]]*-1","v":0},{"$f":"Tabelle1[[#This Row],[Menge\n    *)]]*-1","v":0},"X",{"$f":"Tabelle1[[#This Row],[Menge\n    *)]]*-1","v":0},{"$f":"Tabelle1[[#This Row],[Menge\n    *)]]*-1","v":0},"X","X",{"$f":"Tabelle1[[#This Row],[Menge\n    *)]]*-1","v":0},"X","X","X","X","X","X","X","X"]
[null,null,null,null,"651G8021",0,"GRAFENTHAL HDD 1.8TB 10K 2.5'' SAS","12GB/S"," ",null,null,"X","X",{"$f":"Tabelle1[[#This Row],[Menge\n    *)]]*-1","v":0},{"$f":"Tabelle1[[#This Row],[Menge\n    *)]]*-1","v":0},"X",{"$f":"Tabelle1[[#This Row],[Menge\n    *)]]*-1","v":0},{"$f":"Tabelle1[[#This Row],[Menge\n    *)]]*-1","v":0},"X","X",{"$f":"Tabelle1[[#This Row],[Menge\n    *)]]*-1","v":0},"X","X","X","X","X","X","X","X"]
[null,null,null,null,"651G8022",0,"GRAFENTHAL HDD 2.4TB 10K 2.5'' SAS","12GB/S"," ",null,null,"X","X",{"$f":"Tabelle1[[#This Row],[Menge\n    *)]]*0","v":0},{"$f":"Tabelle1[[#This Row],[Menge\n    *)]]*0","v":0},"X",{"$f":"Tabelle1[[#This Row],[Menge\n    *)]]*-1","v":0},{"$f":"Tabelle1[[#This Row],[Menge\n    *)]]*0","v":0},"X","X",{"$f":"Tabelle1[[#This Row],[Menge\n    *)]]*0","v":0},"X","X","X","X","X","X","X","X"]
[null,null,null,null,"SAS 2,5\" 15k 12GB/s",{"$f":"SUM(F58:F60)","v":0}]
[null,null,null,null,"651G8003",0,"GRAFENTHAL HDD 300GB 15K 2.5\\ SAS 12GB/S\""," "," ",null,null,"X","X",{"$f":"Tabelle1[[#This Row],[Menge\n    *)]]*-1","v":0},{"$f":"Tabelle1[[#This Row],[Menge\n    *)]]*-1","v":0},"X",{"$f":"Tabelle1[[#This Row],[Menge\n    *)]]*-1","v":0},{"$f":"Tabelle1[[#This Row],[Menge\n    *)]]*-1","v":0},"X","X",{"$f":"Tabelle1[[#This Row],[Menge\n    *)]]*-1","v":0},"X","X","X","X","X","X","X","X"]
[null,null,null,null,"651G8004",0,"GRAFENTHAL HDD 600GB 15K 2.5\\ SAS 12GB/S\""," "," ",null,null,"X","X",{"$f":"Tabelle1[[#This Row],[Menge\n    *)]]*-1","v":0},{"$f":"Tabelle1[[#This Row],[Menge\n    *)]]*-1","v":0},"X",{"$f":"Tabelle1[[#This Row],[Menge\n    *)]]*-1","v":0},{"$f":"Tabelle1[[#This Row],[Menge\n    *)]]*-1","v":0},"X","X",{"$f":"Tabelle1[[#This Row],[Menge\n    *)]]*-1","v":0},"X","X","X","X","X","X","X","X"]
[null,null,null,null,"651G8019",0,"GRAFENTHAL HDD 900GB 15K 2.5'' SAS","12GB/S"," ",null,null,"X","X",{"$f":"Tabelle1[[#This Row],[Menge\n    *)]]*-1","v":0},{"$f":"Tabelle1[[#This Row],[Menge\n    *)]]*-1","v":0},"X",{"$f":"Tabelle1[[#This Row],[Menge\n    *)]]*-1","v":0},{"$f":"Tabelle1[[#This Row],[Menge\n    *)]]*-1","v":0},"X","X",{"$f":"Tabelle1[[#This Row],[Menge\n    *)]]*-1","v":0},"X","X","X","X","X","X","X","X"]
[null,null,null,null,"SAS SSD  12GB/s",{"$f":"SUM(F62:F65)","v":0}]
[null,null,null,null,"651G7004",0,"GRAFENTHAL SSD 480GB 2,5'' SAS 12GB/S","MIDRANGE DWPD 1"," ",null,null,"X","X",{"$f":"Tabelle1[[#This Row],[Menge\n    *)]]*-1","v":0},"X","X",{"$f":"Tabelle1[[#This Row],[Menge\n    *)]]*-1","v":0},{"$f":"Tabelle1[[#This Row],[Menge\n    *)]]*-1","v":0},"X","X",{"$f":"Tabelle1[[#This Row],[Menge\n    *)]]*-1","v":0},"X","X","X","X","X","X","X","X"]
[null,null,null,null,"651G7005",0,"GRAFENTHAL SSD 960GB 2,5'' SAS 12GB/S","MIDRANGE DWPD 1"," ",null,null,"X","X",{"$f":"Tabelle1[[#This Row],[Menge\n    *)]]*-1","v":0},"X","X",{"$f":"Tabelle1[[#This Row],[Menge\n    *)]]*-1","v":0},{"$f":"Tabelle1[[#This Row],[Menge\n    *)]]*-1","v":0},"X","X",{"$f":"Tabelle1[[#This Row],[Menge\n    *)]]*-1","v":0},"X","X","X","X","X","X","X","X"]
[null,null,null,null,"651G7006",0,"GRAFENTHAL SSD 1920GB 2,5'' SAS 12GB/S","MIDRANGE DWPD 1"," ",null,null,"X","X",{"$f":"Tabelle1[[#This Row],[Menge\n    *)]]*-1","v":0},"X","X",{"$f":"Tabelle1[[#This Row],[Menge\n    *)]]*-1","v":0},{"$f":"Tabelle1[[#This Row],[Menge\n    *)]]*-1","v":0},"X","X",{"$f":"Tabelle1[[#This Row],[Menge\n    *)]]*-1","v":0},"X","X","X","X","X","X","X","X"]
[null,null,null,null,"651G7007",0,"GRAFENTHAL SSD 3840GB 2,5'' SAS 12GB/S","MIDRANGE DWPD 1"," ",null,null,"X","X",{"$f":"Tabelle1[[#This Row],[Menge\n    *)]]*-1","v":0},"X","X",{"$f":"Tabelle1[[#This Row],[Menge\n    *)]]*-1","v":0},{"$f":"Tabelle1[[#This Row],[Menge\n    *)]]*-1","v":0},"X","X",{"$f":"Tabelle1[[#This Row],[Menge\n    *)]]*-1","v":0},"X","X","X","X","X","X","X","X"]
[null,null,null,null,"SAS 3,5\" 7,2k  12GB/s",{"$f":"SUM(F67:F71)","v":0}]
[null,null,null,null,"651G6021",0,"HDD 2TB SAS 7,2K 3,5“ 12GB/S 24/7","FOR GRAFENTHAL SERVER","MTTF 2.5M HOURS",null,null,"X","X",{"$f":"Tabelle1[[#This Row],[Menge\n    *)]]*-1","v":0},{"$f":"Tabelle1[[#This Row],[Menge\n    *)]]*-1","v":0},{"$f":"Tabelle1[[#This Row],[Menge\n    *)]]*-1","v":0},{"$f":"Tabelle1[[#This Row],[Menge\n    *)]]*-1","v":0},{"$f":"Tabelle1[[#This Row],[Menge\n    *)]]*-1","v":0},"X","X",{"$f":"Tabelle1[[#This Row],[Menge\n    *)]]*-1","v":0},"X","X","X","X","X","X","X","X"]
[null,null,null,null,"651G6020",0,"GRAFENTHAL HDD 4TB SAS 7,2K 3,5“ 12GB/S","24/7","MTTF 2.5M HOURS",null,null,"X","X",{"$f":"Tabelle1[[#This Row],[Menge\n    *)]]*-1","v":0},{"$f":"Tabelle1[[#This Row],[Menge\n    *)]]*-1","v":0},{"$f":"Tabelle1[[#This Row],[Menge\n    *)]]*-1","v":0},{"$f":"Tabelle1[[#This Row],[Menge\n    *)]]*-1","v":0},{"$f":"Tabelle1[[#This Row],[Menge\n    *)]]*-1","v":0},"X","X",{"$f":"Tabelle1[[#This Row],[Menge\n    *)]]*-1","v":0},"X","X","X","X","X","X","X","X"]
[null,null,null,null,"651G6019",0,"HDD 6TB SAS 7,2K 3,5“ 12GB/S 24/7","FOR GRAFENTHAL SERVER","MTTF 2.5M HOURS",null,null,"X","X",{"$f":"Tabelle1[[#This Row],[Menge\n    *)]]*-1","v":0},{"$f":"Tabelle1[[#This Row],[Menge\n    *)]]*-1","v":0},{"$f":"Tabelle1[[#This Row],[Menge\n    *)]]*-1","v":0},{"$f":"Tabelle1[[#This Row],[Menge\n    *)]]*-1","v":0},{"$f":"Tabelle1[[#This Row],[Menge\n    *)]]*-1","v":0},"X","X",{"$f":"Tabelle1[[#This Row],[Menge\n    *)]]*-1","v":0},"X","X","X","X","X","X","X","X"]
[null,null,null,null,"651G6018",0,"HDD 8TB SAS 7,2K 3,5“ 12GB/S 24/7","FOR GRAFENTHAL SERVER","MTTF 2.5M HOURS",null,null,"X","X",{"$f":"Tabelle1[[#This Row],[Menge\n    *)]]*-1","v":0},{"$f":"Tabelle1[[#This Row],[Menge\n    *)]]*-1","v":0},{"$f":"Tabelle1[[#This Row],[Menge\n    *)]]*-1","v":0},{"$f":"Tabelle1[[#This Row],[Menge\n    *)]]*-1","v":0},{"$f":"Tabelle1[[#This Row],[Menge\n    *)]]*-1","v":0},"X","X",{"$f":"Tabelle1[[#This Row],[Menge\n    *)]]*-1","v":0},"X","X","X","X","X","X","X","X"]
[null,null,null,null,"651G6016",0,"HDD 10TB SAS 7,2K 3,5“ 12GB/S 24/7","FOR GRAFENTHAL SERVER","MTTF 2.5M HOURS",null,null,"X","X",{"$f":"Tabelle1[[#This Row],[Menge\n    *)]]*-1","v":0},{"$f":"Tabelle1[[#This Row],[Menge\n    *)]]*-1","v":0},{"$f":"Tabelle1[[#This Row],[Menge\n    *)]]*-1","v":0},{"$f":"Tabelle1[[#This Row],[Menge\n    *)]]*-1","v":0},{"$f":"Tabelle1[[#This Row],[Menge\n    *)]]*-1","v":0},"X","X",{"$f":"Tabelle1[[#This Row],[Menge\n    *)]]*-1","v":0},"X","X","X","X","X","X","X","X"]
[null,null,null,null,"HDD Int",{"$f":"SUM(F73:F83)","v":0}]
[null,null,null,null,"SATA 3,5\" 7,2k 6GB/s",{"$f":"SUM(F74:F77)","v":0}]
[null,null,null,null,"651G6022",0,"HDD 6TB S-ATA 7,2K 3,5“ 6GB/S 24/7","FOR GRAFENTHAL SERVER","MTTF 2.0M HOURS",null,null,"X","X","X","X","X","X","X",{"$f":"Tabelle1[[#This Row],[Menge\n    *)]]*-1","v":0},{"$f":"Tabelle1[[#This Row],[Menge\n    *)]]*-1","v":0},"X",{"$f":"Tabelle1[[#This Row],[Menge\n    *)]]*-1","v":0},{"$f":"Tabelle1[[#This Row],[Menge\n    *)]]*-1","v":0},"X","X","X","X","X","X"]
[null,null,null,null,"651G6023",0,"GRAFENTHAL HDD 4TB S-ATA 7,2K 3,5“","6GB/S 24/7","MTTF 2.0M HOURS",null,null,"X","X","X","X","X","X","X",{"$f":"Tabelle1[[#This Row],[Menge\n    *)]]*-1","v":0},{"$f":"Tabelle1[[#This Row],[Menge\n    *)]]*-1","v":0},"X",{"$f":"Tabelle1[[#This Row],[Menge\n    *)]]*-1","v":0},{"$f":"Tabelle1[[#This Row],[Menge\n    *)]]*-1","v":0},"X","X","X","X","X","X"]
[null,null,null,null,"651G6024",0,"HDD 2TB S-ATA 7,2K 3,5“ 6GB/S 24/7","FOR GRAFENTHAL SERVER","MTTF 2.0M HOURS",null,null,"X","X","X","X","X","X","X",{"$f":"Tabelle1[[#This Row],[Menge\n    *)]]*-1","v":0},{"$f":"Tabelle1[[#This Row],[Menge\n    *)]]*-1","v":0},"X",{"$f":"Tabelle1[[#This Row],[Menge\n    *)]]*-1","v":0},{"$f":"Tabelle1[[#This Row],[Menge\n    *)]]*-1","v":0},"X","X","X","X","X","X"]
[null,null,null,null,"651G6025",0,"HDD 10TB S-ATA 7,2K 3,5“ 6GB/S 24/7","FOR GRAFENTHAL SERVER","MTTF 2.0M HOURS",null,null,"X","X","X","X","X","X","X",{"$f":"Tabelle1[[#This Row],[Menge\n    *)]]*-1","v":0},{"$f":"Tabelle1[[#This Row],[Menge\n    *)]]*-1","v":0},"X",{"$f":"Tabelle1[[#This Row],[Menge\n    *)]]*-1","v":0},{"$f":"Tabelle1[[#This Row],[Menge\n    *)]]*-1","v":0},"X","X","X","X","X","X"]
[null,null,null,null,"SAS 7,2k 12GB/s",{"$f":"SUM(F79:F83)","v":0}]
[null,null,null,null,"651G6021",0,"HDD 2TB SAS 7,2K 3,5“ 12GB/S 24/7","FOR GRAFENTHAL SERVER","MTTF 2.5M HOURS",null,null,"X","X","X","X","X","X","X",{"$f":"Tabelle1[[#This Row],[Menge\n    *)]]*-1","v":0},{"$f":"Tabelle1[[#This Row],[Menge\n    *)]]*-1","v":0},{"$f":"Tabelle1[[#This Row],[Menge\n    *)]]*-1","v":0},{"$f":"Tabelle1[[#This Row],[Menge\n    *)]]*-1","v":0},{"$f":"Tabelle1[[#This Row],[Menge\n    *)]]*-1","v":0},"X","X","X","X","X","X"]
[null,null,null,null,"651G6020",0,"GRAFENTHAL HDD 4TB SAS 7,2K 3,5“ 12GB/S","24/7","MTTF 2.5M HOURS",null,null,"X","X","X","X","X","X","X",{"$f":"Tabelle1[[#This Row],[Menge\n    *)]]*-1","v":0},{"$f":"Tabelle1[[#This Row],[Menge\n    *)]]*-1","v":0},{"$f":"Tabelle1[[#This Row],[Menge\n    *)]]*-1","v":0},{"$f":"Tabelle1[[#This Row],[Menge\n    *)]]*-1","v":0},{"$f":"Tabelle1[[#This Row],[Menge\n    *)]]*-1","v":0},"X","X","X","X","X","X"]
[null,null,null,null,"651G6019",0,"HDD 6TB SAS 7,2K 3,5“ 12GB/S 24/7","FOR GRAFENTHAL SERVER","MTTF 2.5M HOURS",null,null,"X","X","X","X","X","X","X",{"$f":"Tabelle1[[#This Row],[Menge\n    *)]]*-1","v":0},{"$f":"Tabelle1[[#This Row],[Menge\n    *)]]*-1","v":0},{"$f":"Tabelle1[[#This Row],[Menge\n    *)]]*-1","v":0},{"$f":"Tabelle1[[#This Row],[Menge\n    *)]]*-1","v":0},{"$f":"Tabelle1[[#This Row],[Menge\n    *)]]*-1","v":0},"X","X","X","X","X","X"]
[null,null,null,null,"651G6018",0,"HDD 8TB SAS 7,2K 3,5“ 12GB/S 24/7","FOR GRAFENTHAL SERVER","MTTF 2.5M HOURS",null,null,"X","X","X","X","X","X","X",{"$f":"Tabelle1[[#This Row],[Menge\n    *)]]*-1","v":0},{"$f":"Tabelle1[[#This Row],[Menge\n    *)]]*-1","v":0},{"$f":"Tabelle1[[#This Row],[Menge\n    *)]]*-1","v":0},{"$f":"Tabelle1[[#This Row],[Menge\n    *)]]*-1","v":0},{"$f":"Tabelle1[[#This Row],[Menge\n    *)]]*-1","v":0},"X","X","X","X","X","X"]
[null,null,null,null,"651G6016",0,"HDD 10TB SAS 7,2K 3,5“ 12GB/S 24/7","FOR GRAFENTHAL SERVER","MTTF 2.5M HOURS",null,null,"X","X","X","X","X","X","X",{"$f":"Tabelle1[[#This Row],[Menge\n    *)]]*-1","v":0},{"$f":"Tabelle1[[#This Row],[Menge\n    *)]]*-1","v":0},{"$f":"Tabelle1[[#This Row],[Menge\n    *)]]*-1","v":0},{"$f":"Tabelle1[[#This Row],[Menge\n    *)]]*-1","v":0},{"$f":"Tabelle1[[#This Row],[Menge\n    *)]]*-1","v":0},"X","X","X","X","X","X"]
[null,null,null,null,"HDD Int M.2NVMe",{"$f":"SUM(F85)","v":0}]
[null,null,null,null,"651G7000",0,"GRAFENTHAL SSD 512GB NVME M.2","PCIe 3.0 x4 READ 3500MB/S WRITE 2100MB/S"," ",null,null,"X","X","X","X","X","X","X","X","X","X","X","X","X",{"$f":"Tabelle1[[#This Row],[Menge\n    *)]]*-1","v":0},{"$f":"Tabelle1[[#This Row],[Menge\n    *)]]*-1","v":0},"X","X","X"]
[null,null,null,"+","HDD Int M.2 SATA",{"$f":"SUM(F90)","v":0}]
[null,null,null,"+","651G8000",0,"GRAFENTHAL SSD 256GB M.2 2280 SATA 6GB/S","256BIT-AES MTBF 1.6M HOURS TBW 144TB"," ",null,null,"X","X","X","X","X","X","X","X","X","X","X","X","X",{"$f":"Tabelle1[[#This Row],[Menge\n    *)]]*-1","v":0},{"$f":"Tabelle1[[#This Row],[Menge\n    *)]]*-1","v":0},"X","X","X"]
[null,null,null,"+","651G8001",0,"GRAFENTHAL SSD 512GB M.2 2280 SATA 6GB/S","256BIT-AES MTBF 1.6M HOURS TBW 288TB"," ",null,null,"X","X","X","X","X","X","X","X","X","X","X","X","X",{"$f":"Tabelle1[[#This Row],[Menge\n    *)]]*-1","v":0},{"$f":"Tabelle1[[#This Row],[Menge\n    *)]]*-1","v":0},"X","X","X"]
[null,null,null,"+","651G8002",0,"GRAFENTHAL SSD 1TB M.2 2280 SATA 6GB/S","256BIT-AES TCG OPAL 2.0 MTBF 1.5M HOURS"," ",null,null,"X","X","X","X","X","X","X","X","X","X","X","X","X",{"$f":"Tabelle1[[#This Row],[Menge\n    *)]]*-1","v":0},{"$f":"Tabelle1[[#This Row],[Menge\n    *)]]*-1","v":0},"X","X","X"]
[null,null,null,null,"DVD",{"$f":"SUM(F91)","v":0}]
[null,null,null,null,"658G0002",0,"GRAFENTHAL DRIVE DVD-RW SATA","INTERN SLIM BLACK"," ",null,null,"X","X","X","X","X","X","X","X","X","X","X","X","X","X","X","X","X",{"$f":"Tabelle1[[#This Row],[Menge\n    *)]]*-1","v":0}]
[null,null,null,null,"Raid Controller",{"$f":"SUM(F93:F95)","v":0}]
[null,null,null,null,"653G7004",0,"GRAFENTHAL MEGARAID 9341-4i CONTROLLER","SATA 6GB/S SAS 12GB/S PCIe 3.0 x8","RAID 0 1 5 10 50 TYP 9341-4I",null,null,"X","X","X","X","X","X","X","X","X",{"$f":"Tabelle1[[#This Row],[Menge\n    *)]]*4","v":0},"X","X","X",{"$f":"Tabelle1[[#This Row],[Menge\n    *)]]*-1","v":0},{"$f":"Tabelle1[[#This Row],[Menge\n    *)]]*-1","v":0},{"$f":"Tabelle1[[#This Row],[Menge\n    *)]]*-1","v":0},"X","X"]
[null,null,null,null,"653G5008",0,"GRAFENTHAL RAID CONTROLLER SAS/SATA","12GB/S /6GB/S 8i NO CACHE"," ",null,null,"X","X","X","X","X","X","X","X","X",{"$f":"Tabelle1[[#This Row],[Menge\n    *)]]*8","v":0},"X","X","X",{"$f":"Tabelle1[[#This Row],[Menge\n    *)]]*-1","v":0},{"$f":"Tabelle1[[#This Row],[Menge\n    *)]]*-1","v":0},{"$f":"Tabelle1[[#This Row],[Menge\n    *)]]*-1","v":0},"X","X"]
[null,null,null,null,"653G6002",0,"GRAFENTHAL CABLE 0,5M","SFF-8643 TO 4x S-ATA"," ",null,null,"X","X","X","X","X","X","X","X","X","X","X","X","X","X","X","X","X","X"]
[null,null,null,null,"653G5903",0,"GRAFENTHAL CACHEVAULT FLASH CACHE","PROTECTION MODULE FOR RAID CTR"," "]
[null,null,null,null,"653G7001",0,"GRAFENTHAL MEGARAID CACHECADE PRO 2.0","PHYSICAL KEY SSD CACHE ENABLER"," "]
[null,null,null,null,"HBA SAS",{"$f":"SUM(F99:F102)","v":0}]
[null,null,null,null,"659G4013",0,"GRAFENTHAL EXTERNAL SAS CABLE 1M","MINI MULTILANE SFF-8088 TO SFF-8644"," ",null,null,"X","X","X","X","X","X","X","X","X","X","X","X","X","X","X","X","X","X"]
[null,null,null,null,"653G7006",0,"GRAFENTHAL EXTERNAL SAS CABLE 2M","SFF-8644 TO SFF-8644"," ",null,null,"X","X","X","X","X","X","X","X","X","X","X","X","X","X","X","X","X","X"]
[null,null,null,null,"653G7007",0,"GRAFENTHAL EXTERNAL SAS CABLE 1M","SFF-8644 TO SFF-8644"," ",null,null,"X","X","X","X","X","X","X","X","X","X","X","X","X","X","X","X","X","X"]
[null,null,null,null,"653G6005",0,"GRAFENTHAL HBA SAS/SATA 12Gb/s 9300-4i4e"," "," ",null,null,"X","X","X","X","X","X","X","X","X","X","X","X","X","X",{"$f":"Tabelle1[[#This Row],[Menge\n    *)]]*-1","v":0},{"$f":"Tabelle1[[#This Row],[Menge\n    *)]]*-1","v":0},"X","X"]
[null,null,null,null,"(Kupfer-) Netzkarte",{"$f":"SUM(F104:F106)","v":0}]
[null,null,null,null,"653G5002",0,"GRAFENTHAL ETHERNET CARD 2x 10GB/S","PCIe 2.0 x8 RJ-45 LP INTEL"," ",null,null,"X","X","X","X","X","X","X","X","X","X","X","X","X",{"$f":"Tabelle1[[#This Row],[Menge\n    *)]]*-1","v":0},{"$f":"Tabelle1[[#This Row],[Menge\n    *)]]*-1","v":0},{"$f":"Tabelle1[[#This Row],[Menge\n    *)]]*-1","v":0},"X","X"]
[null,null,null,null,"659G6005",0,"GRAFENTHAL ETHERNET CARD 2x10GB","INTEL X540-T2 COPPER LOW PROFILE","PCI EXPRESS 2.0",null,null,"X","X","X","X","X","X","X","X","X","X","X","X","X",{"$f":"Tabelle1[[#This Row],[Menge\n    *)]]*-1","v":0},{"$f":"Tabelle1[[#This Row],[Menge\n    *)]]*-1","v":0},{"$f":"Tabelle1[[#This Row],[Menge\n    *)]]*-1","v":0},"X","X"]
[null,null,null,null,"659G8015",0,"GRAFENTHAL GIGABIT ETHERNET APDATER","I350-T4V2 4x RJ-45 PCIe x4 COPPER"," ",null,null,"X","X","X","X","X","X","X","X","X","X","X","X","X",{"$f":"Tabelle1[[#This Row],[Menge\n    *)]]*-1","v":0},{"$f":"Tabelle1[[#This Row],[Menge\n    *)]]*-1","v":0},null,"X","X"]
[null,null,null,null,"(SFP+)Netzwerkkarte",{"$f":"SUM(#REF!)","v":{"$error":"#REF!"}}]
[null,null,null,null,"653G7003",0,"GRAFENTHAL ETHERNET ADAPTER 2-PORT 10GBE","INTEL X520 FIBRE SFP+ PCIe x8 LP"," ",null,null,null,null,{"$f":"Tabelle1[[#This Row],[Menge\n    *)]]*0","v":0},{"$f":"Tabelle1[[#This Row],[Menge\n    *)]]*0","v":0},{"$f":"Tabelle1[[#This Row],[Menge\n    *)]]*0","v":0},null,{"$f":"Tabelle1[[#This Row],[Menge\n    *)]]*0","v":0},null,{"$f":"Tabelle1[[#This Row],[Menge\n    *)]]*-1","v":0},{"$f":"Tabelle1[[#This Row],[Menge\n    *)]]*0","v":0},{"$f":"Tabelle1[[#This Row],[Menge\n    *)]]*3","v":0},null,null,null,null,null,null,{"$f":"Tabelle1[[#This Row],[Menge\n    *)]]*0","v":0}]
[null,null,null,null,"Glasfaserkarten",{"$f":"SUM(F110:F111)","v":0}]
[null,null,null,null,"659G7000",0,"GRAFENTHAL QLOGIC HBA FC SINGLE PORT","16GB/S PCIe 3.0 x8"," ",null,null,"X","X","X","X","X","X","X","X","X","X","X","X","X",{"$f":"Tabelle1[[#This Row],[Menge\n    *)]]*-1","v":0},{"$f":"Tabelle1[[#This Row],[Menge\n    *)]]*-1","v":0},{"$f":"Tabelle1[[#This Row],[Menge\n    *)]]*-1","v":0},"X","X"]
[null,null,null,null,"659G7001",0,"GRAFENTHAL QLOGIC HBA FC DUAL PORT","16GB/S PCIe 3.0 x8"," ",null,null,"X","X","X","X","X","X","X","X","X","X","X","X","X",{"$f":"Tabelle1[[#This Row],[Menge\n    *)]]*-1","v":0},{"$f":"Tabelle1[[#This Row],[Menge\n    *)]]*-1","v":0},{"$f":"Tabelle1[[#This Row],[Menge\n    *)]]*-1","v":0},"X","X"]
[null,null,null,null,"Grafikkarte",{"$f":"SUM(#REF!)","v":{"$error":"#REF!"}}]
[null,null,null,null,"Betriebssysteme",{"$f":"SUM(F114:F115)","v":0}]
[null,null,null,null,"655G3002",0,"GRAFENTHAL WINDOWS SERVER 2012 R2","ESSENTIALS LIZENZ UND MEDIEN 1-2 CPU"," ",null,null,"X","X","X","X","X","X","X","X","X","X","X","X","X","X","X","X","X","X"]
[null,null,null,null,"655G3003",0,"GRAFENTHAL WINDOWS SERVER 2012 R2","STANDARD LIZENZ UND MEDIEN 2 CPU"," ",null,null,"X","X","X","X","X","X","X","X","X","X","X","X","X","X","X","X","X","X"]
[null,null,null,null,"P73-07115",0,"MICROSOFT WINDOWS SERVER 2016 STANDARD","64BIT 16C"," "]
[null,null,null,null,"Open-E",{"$f":"SUM(F118:F129)","v":0}]
[null,null,null,null,1701,0,"OPEN-E DSS V7 STORAGE SOFTWARE OS, 4TB"," ",null,null,null,"X","X","X","X","X","X","X","X","X","X","X","X","X","X","X","X","X","X"]
[null,null,null,null,1702,0,"OPEN-E DSS V7 STORAGE SOFTWARE OS, 8TB"," ",null,null,null,"X","X","X","X","X","X","X","X","X","X","X","X","X","X","X","X","X","X"]
[null,null,null,null,1703,0,"OPEN-E DSS V7 STORAGE SOFTWARE OS, 16TB"," ",null,null,null,"X","X","X","X","X","X","X","X","X","X","X","X","X","X","X","X","X","X"]
[null,null,null,null,1704,0,"OPEN-E DSS V7 STORAGE SOFTWARE OS,","UNLIMITED TB",null,null,null,"X","X","X","X","X","X","X","X","X","X","X","X","X","X","X","X","X","X"]
[null,null,null,null,1719,0,"OPEN-E FEATURE PACK-ACTIVE iSCSI,","FAILOVER V7 ONLY TWO LICENSE KEY",null,null,null,"X","X","X","X","X","X","X","X","X","X","X","X","X","X","X","X","X","X"]
[null,null,null,null,1775,0,"OPEN-E STANDARD SUPPORT, 1 YEAR,","8 BUSINESS HR PHONE OR EMAIL",null,null,null,"X","X","X","X","X","X","X","X","X","X","X","X","X","X","X","X","X","X"]
[null,null,null,null,1776,0,"OPEN-E PREMIUM SUPPORT, 1 YEAR","4 BUSINESS HR PHONE EMAIL REMOTE CONSOLE",null,null,null,"X","X","X","X","X","X","X","X","X","X","X","X","X","X","X","X","X","X"]
[null,null,null,null,1777,0,"OPEN-E 24/7 SUPPORT,3 YEARS,4 BUSI. HR.","UP TO 4H AFTER SUBMISSION OF TICKET",null,null,null,"X","X","X","X","X","X","X","X","X","X","X","X","X","X","X","X","X","X"]
[null,null,null,null,1778,0,"OPEN-E UPGRADE TO 3 YEARS BASIC SUPPORT"," ",null,null,null,"X","X","X","X","X","X","X","X","X","X","X","X","X","X","X","X","X","X"]
[null,null,null,null,1779,0,"OPEN-E UPGRADE TO 3 YEARS STANDARD","SUPPORT",null,null,null,"X","X","X","X","X","X","X","X","X","X","X","X","X","X","X","X","X","X"]
[null,null,null,null,1780,0,"OPEN-E UPGRADE TO 3 YEARS PREMIUM","SUPPORT",null,null,null,"X","X","X","X","X","X","X","X","X","X","X","X","X","X","X","X","X","X"]
[null,null,null,null,1781,0,"OPEN-E 24/7 SUPPORT,3 YEARS,4 BUSI. HR.","UP TO 4H AFTER SUBMISSION OF TICKET",null,null,null,"X","X","X","X","X","X","X","X","X","X","X","X","X","X","X","X","X","X"]
[null,null,null,null,"MPAC",{"$f":"SUM(F131:F148)","v":0}]
[null,null,null,null,"740M6001",0,"GRAFENTHAL MPAC VOR ORT SERVICE UPGRADE","3JAHRE 13x5 24STD WIEDERHERSTELLUNG","FÜR GRAFENTHAL T1003 S2",null,null,"X","X","X","X","X","X","X","X","X","X","X","X","X","X","X","X","X","X"]
[null,null,null,null,"740M6002",0,"GRAFENTHAL MPAC VOR ORT SERVICE UPGRADE","3JAHRE 13x5 12STD WIEDERHERSTELLUNG","FÜR GRAFENTHAL T1003 S2",null,null,"X","X","X","X","X","X","X","X","X","X","X","X","X","X","X","X","X","X"]
[null,null,null,null,"740M6003",0,"GRAFENTHAL MPAC VOR ORT SERVICE UPGRADE","3JAHRE 24x7 6STD WIEDERHERSTELLUNG","FÜR GRAFENTHAL T1003 S2",null,null,"X","X","X","X","X","X","X","X","X","X","X","X","X","X","X","X","X","X"]
[null,null,null,null,"740M6004",0,"GRAFENTHAL MPAC VOR ORT SERVICE UPGRADE","4JAHRE 13x5 24STD WIEDERHERSTELLUNG","FÜR GRAFENTHAL T1003 S2",null,null,"X","X","X","X","X","X","X","X","X","X","X","X","X","X","X","X","X","X"]
[null,null,null,null,"740M6005",0,"GRAFENTHAL MPAC VOR ORT SERVICE UPGRADE","4JAHRE 13x5 12STD WIEDERHERSTELLUNG","FÜR GRAFENTHAL T1003 S2",null,null,"X","X","X","X","X","X","X","X","X","X","X","X","X","X","X","X","X","X"]
[null,null,null,null,"740M6006",0,"GRAFENTHAL MPAC VOR ORT SERVICE UPGRADE","4JAHRE 24x7 6STD WIEDERHERSTELLUNG","FÜR GRAFENTHAL T1003 S2",null,null,"X","X","X","X","X","X","X","X","X","X","X","X","X","X","X","X","X","X"]
[null,null,null,null,"740M6007",0,"GRAFENTHAL MPAC VOR ORT SERVICE UPGRADE","5JAHRE 13x5 24STD WIEDERHERSTELLUNG","FÜR GRAFENTHAL T1003 S2",null,null,"X","X","X","X","X","X","X","X","X","X","X","X","X","X","X","X","X","X"]
[null,null,null,null,"740M6008",0,"GRAFENTHAL MPAC VOR ORT SERVICE UPGRADE","5JAHRE 13x5 12STD WIEDERHERSTELLUNG","FÜR GRAFENTHAL T1003 S2",null,null,"X","X","X","X","X","X","X","X","X","X","X","X","X","X","X","X","X","X"]
[null,null,null,null,"740M6009",0,"GRAFENTHAL MPAC VOR ORT SERVICE UPGRADE","5JAHRE 24x7 6STD WIEDERHERSTELLUNG","FÜR GRAFENTHAL T1003 S2",null,null,"X","X","X","X","X","X","X","X","X","X","X","X","X","X","X","X","X","X"]
[null,null,null,null,"740M6052",0,"GRAFENTHAL MPAC VOR ORT SERVICE UPGRADE","3JAHRE 13x5 24STD  WIEDERHERSTELLUNG DMR","FÜR GRAFENTHAL SERVER T1003 / T1004 S2",null,null,"X","X","X","X","X","X","X","X","X","X","X","X","X","X","X","X","X","X"]
[null,null,null,null,"740M6053",0,"GRAFENTHAL MPAC VOR ORT SERVICE UPGRADE","3JAHRE 13x5 12STD  WIEDERHERSTELLUNG DMR","FÜR GRAFENTHAL SERVER T1003 / T1004 S2",null,null,"X","X","X","X","X","X","X","X","X","X","X","X","X","X","X","X","X","X"]
[null,null,null,null,"740M6054",0,"GRAFENTHAL MPAC VOR ORT SERVICE UPGRADE","3JAHRE 24x7 6 STD  WIEDERHERSTELLUNG DMR","FÜR GRAFENTHAL SERVER T1003 / T1004 S2",null,null,"X","X","X","X","X","X","X","X","X","X","X","X","X","X","X","X","X","X"]
[null,null,null,null,"740M6055",0,"GRAFENTHAL MPAC VOR ORT SERVICE UPGRADE","4JAHRE 13x5 24STD  WIEDERHERSTELLUNG DMR","FÜR GRAFENTHAL SERVER T1003 / T1004 S2",null,null,"X","X","X","X","X","X","X","X","X","X","X","X","X","X","X","X","X","X"]
[null,null,null,null,"740M6056",0,"GRAFENTHAL MPAC VOR ORT SERVICE UPGRADE","4JAHRE 13x5 12STD  WIEDERHERSTELLUNG DMR","FÜR GRAFENTHAL SERVER T1003 / T1004 S2",null,null,"X","X","X","X","X","X","X","X","X","X","X","X","X","X","X","X","X","X"]
[null,null,null,null,"740M6057",0,"GRAFENTHAL MPAC VOR ORT SERVICE UPGRADE","4JAHRE 24x7 6 STD  WIEDERHERSTELLUNG DMR","FÜR GRAFENTHAL SERVER T1003 / T1004 S2",null,null,"X","X","X","X","X","X","X","X","X","X","X","X","X","X","X","X","X","X"]
[null,null,null,null,"740M6058",0,"GRAFENTHAL MPAC VOR ORT SERVICE UPGRADE","5JAHRE 13x5 24STD  WIEDERHERSTELLUNG DMR","FÜR GRAFENTHAL SERVER T1003 / T1004 S2",null,null,"X","X","X","X","X","X","X","X","X","X","X","X","X","X","X","X","X","X"]
[null,null,null,null,"740M6059",0,"GRAFENTHAL MPAC VOR ORT SERVICE UPGRADE","5JAHRE 13x5 12STD  WIEDERHERSTELLUNG DMR","FÜR GRAFENTHAL SERVER T1003 / T1004 S2",null,null,"X","X","X","X","X","X","X","X","X","X","X","X","X","X","X","X","X","X"]
[null,null,null,null,"740M6060",0,"GRAFENTHAL MPAC VOR ORT SERVICE UPGRADE","5JAHRE 24x7 6 STD  WIEDERHERSTELLUNG DMR","FÜR GRAFENTHAL SERVER T1003 / T1004 S2",null,null,"X","X","X","X","X","X","X","X","X","X","X","X","X","X","X","X","X","X"]
[null,null,null,null,"CONFIG-TO-ORDER",{"$f":"SUM(F150:F153)","v":0}]
[null,null,null,null,"CTO",0,"HARDWARE ASSEMBLIERUNG",null,null,null,null,"X","X","X","X","X","X","X","X","X","X","X","X","X","X","X","X","X","X"]
[null,null,null,null,"CTO1",0,"HARDWARE ASSEMBLIERUNG & FIRMWARE UPDATE",null,null,null,null,"X","X","X","X","X","X","X","X","X","X","X","X","X","X","X","X","X","X"]
[null,null,null,null,"CTO2",0,"HARDWARE ASSEMBLIERUNG, FIRMWARE UPDATE & RAID EINRICHTUNG",null,null,null,null,"X","X","X","X","X","X","X","X","X","X","X","X","X","X","X","X","X","X"]
[null,null,null,null,"CTO3",0,"HARDWARE ASSEMBLIERUNG, FIRMWARE UPDATE, RAID EINRICHTUNG & OS INSTALLATION",null,null,null,null,"X","X","X","X","X","X","X","X","X","X","X","X","X","X","X","X","X","X"]
[null,null,null,null,"Maus, Tastatur",{"$f":"SUM(F155)","v":0}]
[null,null,null,null,"659G3001",0,"GRAFENTHAL TASTATUR MAUS SET WIRED"," "," ",null,null,"X","X","X","X","X","X","X","X","X","X","X","X","X","X","X","X","X","X"]
[null,null,null,null,"USB Drive",0]
[null,null,null,null,"652G6004",0,"GRAFENTHAL USB 3.0 FLASH DRIVE","ULTRA FIT 64GB UP TO 150MB/S"," ",null,null,"X","X","X","X","X","X","X","X","X","X","X","X","X","X","X","X","X","X"]
[null,null,null,null,"652G6005",0,"GRAFENTHAL USB 3.0 FLASH DRIVE","ULTRA FIT 128GB UP TO 150MB/S"," ",null,null,"X","X","X","X","X","X","X","X","X","X","X","X","X","X","X","X","X","X"]
[null,null,null,null,"USV- Systeme",{"$f":"SUM(F160:F161)","v":0}]
[null,null,null,null,"122G0075",0,"GRAFENTHAL USV ET-750 LINE INTERACTIVE","LCD USB AVR 750VA 480W PURE SINEWAVE","RJ11 8.3KG CE ROHS GERMAN",null,null,"X","X","X","X","X","X","X","X","X","X","X","X","X","X","X","X","X","X"]
[null,null,null,null,"122G0150",0,"GRAFENTHAL USV ET-1500 LINE INTERACTIVE","LCD USB AVR 1500VA 1050W PURE SINEWAVE","RJ11 11.6KG CE ROHS GERMAN",null,null,"X","X","X","X","X","X","X","X","X","X","X","X","X","X","X","X","X","X"]
[null,null,null,null,"SUMME",1,null,null,null,{"$f":"COUNTIF($J$163:$AC$163,\"<0\")","v":0}]
[null,null,null,null,null,null,null,null,null,{"$f":"SUM(J14:J161)","v":0},{"$f":"SUM(K14:K161)","v":0},{"$f":"SUM(L14:L161)","v":0},{"$f":"SUM(M14:M161)","v":0},0,0,0,0,0,0,0,0,0,0,0,0,0,0,0,0]

{"sheet":"T1004 S2","index":2,"n_rows":146,"n_cols":29,"rows_kept":146,"cut":false,"hidden":false,"merged":[[0,4,0,8]]}
[null,null,null,null,"SFF Tower T1004 S2"]
[]
[null,null,null,null,null,null,null,"Intel® Xeon® E3-1200 v5 Produktfamilie","more Info"]
[null,null,null,null,null,null,null,"bis 64GB DDR4 ECC RAM Arbeitsspeicher"]
[null,null,null,null,null,null,null,"M.2 NVMe-SSD Option"]
[null,null,null,null,null,null,null,"Hot-Swap HDD oder SSD"]
[null,null,null,null,null,null,null,"RAID 0/1/5/10","* Felder werden automatisch ausgefüllt"]
[null,null,null,null,null,null,null,"Dual Gigabit Ethernet","*) \"Menge\" filtern um Konfiguration anzuzeigen"]
[null,null,null,null,null,null,null,"integrierte Fernwartungsfunktion"]
[]
[null,null,null,null,"Konfigurator",null,{"$f":"'Revision Info'!B10","v":"Revision 15"}]
[null,null,null,null,"ART. NR.","Menge\n    *)","Bezeichnung","Bezeichnung II","Bezeichnung III","nicht kombinierbar","nicht konfigurierbar","CPU Slots","MEM Slots","SSD Slots","HDD Slots HS 2.5","HDD Slots HS 3.5","HDD Slots HS SAS","HDD Slots HS SATA","HDD Slots NHS SAS","HDD Slots NHS SATA","SAS Ports","Int HDD Slots","3,5 Slots","5,25 Slots","PCI x1 Slots","PCI x4 Slots","PCI x8 Slots","PCI x16 Slots","DVD Slot"]
[null,null,null,null,"Maschinentyp",{"$f":"SUM(F14:F14)","v":0},null,null,null,"if (Kombi);-1;0","if Menge;-1;0","(Menge x Eigenschaft)","(Menge x Eigenschaft)","(Menge x Eigenschaft)","(Menge x Eigenschaft)","(Menge x Eigenschaft)","(Menge x Eigenschaft)","(Menge x Eigenschaft)","(Menge x Eigenschaft)","(Menge x Eigenschaft)","(Menge x Eigenschaft)","(Menge x Eigenschaft)","(Menge x Eigenschaft)","(Menge x Eigenschaft)","(Menge x Eigenschaft)","(Menge x Eigenschaft)","(Menge x Eigenschaft)","(Menge x Eigenschaft)","(Menge x Eigenschaft)"]
[null,null,null,null,"621G6001",0,"GRAFENTHAL CTO COMPACT SERVER T1004 S2","1x5,25\\ MEDIA BAY DUAL GBIT NIC\"","C236 RAID 0,1,5,10 ON BOARD 300W GOLD",null,null,{"$f":"Tabelle3[[#This Row],[Menge\n    *)]]*1","v":0},{"$f":"Tabelle3[[#This Row],[Menge\n    *)]]*4","v":0},{"$f":"Tabelle3[[#This Row],[Menge\n    *)]]*0","v":0},{"$f":"Tabelle3[[#This Row],[Menge\n    *)]]*0","v":0},{"$f":"Tabelle3[[#This Row],[Menge\n    *)]]*0","v":0},{"$f":"Tabelle3[[#This Row],[Menge\n    *)]]*0","v":0},{"$f":"Tabelle3[[#This Row],[Menge\n    *)]]*0","v":0},{"$f":"Tabelle3[[#This Row],[Menge\n    *)]]*2","v":0},{"$f":"Tabelle3[[#This Row],[Menge\n    *)]]*2","v":0},{"$f":"Tabelle3[[#This Row],[Menge\n    *)]]*0","v":0},{"$f":"Tabelle3[[#This Row],[Menge\n    *)]]*2","v":0},{"$f":"Tabelle3[[#This Row],[Menge\n    *)]]*2","v":0},{"$f":"Tabelle3[[#This Row],[Menge\n    *)]]*1","v":0},{"$f":"Tabelle3[[#This Row],[Menge\n    *)]]*4","v":0},{"$f":"Tabelle3[[#This Row],[Menge\n    *)]]*3","v":0},{"$f":"Tabelle3[[#This Row],[Menge\n    *)]]*2","v":0},{"$f":"Tabelle3[[#This Row],[Menge\n    *)]]*1","v":0},{"$f":"Tabelle3[[#This Row],[Menge\n    *)]]*0","v":0}]
[null,null,null,null,"Prozessor",{"$f":"SUM(F16:F22)","v":0}]
[null,null,null,null,"656G8000",0,"GRAFENTHAL CPU XEON E3-1220v6 3.00GHz 4C","8MB 72W"," ",null,null,{"$f":"Tabelle3[[#This Row],[Menge\n    *)]]*-1","v":0},"X","X","X","X","X","X","X","X","X","X","X","X","X","X","X","X","X"]
[null,null,null,null,"656G8001",0,"GRAFENTHAL CPU XEON E3-1230v6 3.50GHz 4C","8MB 72W"," ",null,null,{"$f":"Tabelle3[[#This Row],[Menge\n    *)]]*-1","v":0},"X","X","X","X","X","X","X","X","X","X","X","X","X","X","X","X","X"]
[null,null,null,null,"656G8002",0,"GRAFENTHAL CPU XEON E3-1240v6 3.70GHz 4C","8MB 72W"," ",null,null,{"$f":"Tabelle3[[#This Row],[Menge\n    *)]]*-1","v":0},"X","X","X","X","X","X","X","X","X","X","X","X","X","X","X","X","X"]
[null,null,null,null,"656G8003",0,"GRAFENTHAL CPU XEON E3-1245v6 3.70GHz 4C","8MB 73W INTEL HD GRAPHICS P630"," ",null,null,{"$f":"Tabelle3[[#This Row],[Menge\n    *)]]*-1","v":0},"X","X","X","X","X","X","X","X","X","X","X","X","X","X","X","X","X"]
[null,null,null,null,"656G8004",0,"GRAFENTHAL CPU XEON E3-1270v6 3.80GHz 4C","8MB 72W"," ",null,null,{"$f":"Tabelle3[[#This Row],[Menge\n    *)]]*-1","v":0},"X","X","X","X","X","X","X","X","X","X","X","X","X","X","X","X","X"]
[null,null,null,null,"656G8005",0,"GRAFENTHAL CPU XEON E3-1275v6 3.80GHz 4C","8MB 73W INTEL HD GRAPHICS P630"," ",null,null,{"$f":"Tabelle3[[#This Row],[Menge\n    *)]]*-1","v":0},"X","X","X","X","X","X","X","X","X","X","X","X","X","X","X","X","X"]
[null,null,null,null,"656G8006",0,"GRAFENTHAL CPU XEON E3-1280v6 3.90GHz 4C","8MB 72W"," ",null,null,{"$f":"Tabelle3[[#This Row],[Menge\n    *)]]*-1","v":0},"X","X","X","X","X","X","X","X","X","X","X","X","X","X","X","X","X"]
[null,null,null,null,"Arbeitsspeicher",{"$f":"SUM(F24:F25)","v":0}]
[null,null,null,null,"652G7004",0,"GRAFENTHAL MEM 8GB DDR4-2400MHz UDIMM","PC4-19200 CL17 DUAL RANKED ECC"," ",null,null,null,{"$f":"Tabelle3[[#This Row],[Menge\n    *)]]*-1","v":0}]
[null,null,null,null,"652G7005",0,"GRAFENTHAL MEM 16GB DDR4-2400MHz UDIMM","PC4-19200 CL17 DUAL RANKED ECC"," ",null,null,"X",{"$f":"Tabelle3[[#This Row],[Menge\n    *)]]*-1","v":0},"X","X","X","X","X","X","X","X","X","X","X","X","X","X","X","X"]
[null,null,null,null,"HDD Bays",{"$f":"SUM(F27:F31)","v":0}]
[null,null,null,null,"657G5004",0,"GRAFENTHAL 2 x 2,5'' HDD / SSD","EXPANSION UNIT 1 x SLIM OPTICAL DRIVE","SATA3 6GB  5,25'' SIZE",null,null,"X","X",{"$f":"Tabelle3[[#This Row],[Menge\n    *)]]*2","v":0},{"$f":"Tabelle3[[#This Row],[Menge\n    *)]]*2","v":0},"X",{"$f":"Tabelle3[[#This Row],[Menge\n    *)]]*2","v":0},{"$f":"Tabelle3[[#This Row],[Menge\n    *)]]*2","v":0},"X","X","X","X","X",{"$f":"Tabelle3[[#This Row],[Menge\n    *)]]*-1","v":0},"X","X","X","X",{"$f":"Tabelle3[[#This Row],[Menge\n    *)]]*1","v":0}]
[null,null,null,null,"657G5006",0,"GRAFENTHAL 4 x 2,5'' HOT SWAP BAY","EXPANSION UNIT FOR SAS AND SATA","HDD/SSD",null,null,"X","X",{"$f":"Tabelle3[[#This Row],[Menge\n    *)]]*4","v":0},{"$f":"Tabelle3[[#This Row],[Menge\n    *)]]*4","v":0},"X",{"$f":"Tabelle3[[#This Row],[Menge\n    *)]]*4","v":0},{"$f":"Tabelle3[[#This Row],[Menge\n    *)]]*4","v":0},"X","X","X","X","X",{"$f":"Tabelle3[[#This Row],[Menge\n    *)]]*-1","v":0},"X","X","X","X","X"]
[null,null,null,null,"657G5005",0,"GRAFENTHAL 6 x 2,5'' HS HDD EXPANSION","UNIT SATA ONLY SATA3 6GB  5,25'' SIZE"," ",null,null,"X","X",{"$f":"Tabelle3[[#This Row],[Menge\n    *)]]*6","v":0},"X","X","X",{"$f":"Tabelle3[[#This Row],[Menge\n    *)]]*6","v":0},"X","X","X","X","X",{"$f":"Tabelle3[[#This Row],[Menge\n    *)]]*-1","v":0},"X","X","X","X","X"]
[null,null,null,null,"657G6003",0,"GRAFENTHAL BACKUP TO DISK KIT 2TB HDD","HOT SWAP BAY HDD TRANSPORT CASE"," ",null,null,"X","X","X","X","X","X","X","X","X","X",{"$f":"Tabelle3[[#This Row],[Menge\n    *)]]*-1","v":0},{"$f":"Tabelle3[[#This Row],[Menge\n    *)]]*-1","v":0},"X","X","X","X","X","X"]
[null,null,null,null,"657G6004",0,"GRAFENTHAL BACKUP TO DISK 2TB","HDD ADDITIONAL DISK"," ",null,null,"X","X","X","X","X","X","X","X","X","X","X","X","X","X","X","X","X","X"]
[null,null,null,null,"659G6001",{"$f":"F27+F29+F28+F30","v":0},"GRAFENTHAL POWER SUPPLY CABLE 20CM SATA","15-PIN SATA POWER 2x 4PIN"," ",null,null,"X","X","X","X","X","X","X","X","X","X","X","X","X","X","X","X","X","X"]
[null,null,null,null,"Festplatten",{"$f":"SUM(F35:F36)","v":0}]
[null,null,null,null,"SATA SSD 6GB/s *MIDRANGE*",{"$f":"SUM(F35:F36)","v":0}]
[null,null,null,null,"651G7011",0,"GRAFENTHAL SSD 240GB 2.5'' SATA 6GB/S","MIDRANGE 599 TBW"," ",null,null,"X","X",{"$f":"Tabelle3[[#This Row],[Menge\n    *)]]*-1","v":0},"X","X","X",{"$f":"Tabelle3[[#This Row],[Menge\n    *)]]*-1","v":0},"X","X","X","X","X","X","X","X","X","X","X"]
[null,null,null,null,"651G7012",0,"GRAFENTHAL SSD 480GB 2.5'' SATA 6GB/S","MIDRANGE 945 TBW"," ",null,null,"X","X",{"$f":"Tabelle3[[#This Row],[Menge\n    *)]]*-1","v":0},"X","X","X",{"$f":"Tabelle3[[#This Row],[Menge\n    *)]]*-1","v":0},"X","X","X","X","X","X","X","X","X","X","X"]
[null,null,null,null,"SATA SSD 6GB/s *ENTRY*",{"$f":"SUM(F38:F41)","v":0}]
[null,null,null,null,"651G8024",0,"GRAFENTHAL SSD 256GB SATA3 6GB/S 2.5''","MTBF 1.5M HOURS TBW 300TB"," ",null,null,"X","X",{"$f":"Tabelle3[[#This Row],[Menge\n    *)]]*-1","v":0},"X","X","X",{"$f":"Tabelle3[[#This Row],[Menge\n    *)]]*-1","v":0},"X","X","X","X","X","X","X","X","X","X","X"]
[null,null,null,null,"651G8025",0,"GRAFENTHAL SSD 512GB SATA3 6GB/S 2.5''","MTBF 1.5M HOURS TBW 300TB"," ",null,null,"X","X",{"$f":"Tabelle3[[#This Row],[Menge\n    *)]]*-1","v":0},"X","X","X",{"$f":"Tabelle3[[#This Row],[Menge\n    *)]]*-1","v":0},"X","X","X","X","X","X","X","X","X","X","X"]
[null,null,null,null,"651G8026",0,"GRAFENTHAL SSD 1TB SATA3 6GB/S 2.5''","MTBF 1.5M HOURS TBW 300TB"," ",null,null,"X","X",{"$f":"Tabelle3[[#This Row],[Menge\n    *)]]*-1","v":0},"X","X","X",{"$f":"Tabelle3[[#This Row],[Menge\n    *)]]*-1","v":0},"X","X","X","X","X","X","X","X","X","X","X"]
[null,null,null,null,"651G8027",0,"GRAFENTHAL SSD 2TB SATA3 6GB/S 2.5''","MTBF 1.5M HOURS TBW 300TB"," ",null,null,"X","X",{"$f":"Tabelle3[[#This Row],[Menge\n    *)]]*-1","v":0},"X","X","X",{"$f":"Tabelle3[[#This Row],[Menge\n    *)]]*-1","v":0},"X","X","X","X","X","X","X","X","X","X","X"]
[null,null,null,null,"SATA HDD 6GB/s",{"$f":"SUM(F43)","v":0}]
[null,null,null,null,"651G6002",0,"GRAFENTHAL HDD 1TB 2,5'' SATA 7200RPM","32MB CACHE 6GB/S BAUHÖHE 9.5MM","FUER SERVER UND WORKSTATION",null,null,"X","X",{"$f":"Tabelle3[[#This Row],[Menge\n    *)]]*-1","v":0},{"$f":"Tabelle3[[#This Row],[Menge\n    *)]]*-1","v":0},"X","X",{"$f":"Tabelle3[[#This Row],[Menge\n    *)]]*-1","v":0},"X","X","X","X","X","X","X","X","X","X","X"]
[null,null,null,null,"SAS 2,5\" 10k 12GB/s",{"$f":"SUM(F45:F49)","v":0}]
[null,null,null,null,"651G8020",0,"GRAFENTHAL HDD 300GB 10K 2.5'' SAS","12GB/S"," ",null,null,"X","X",{"$f":"Tabelle3[[#This Row],[Menge\n    *)]]*-1","v":0},{"$f":"Tabelle3[[#This Row],[Menge\n    *)]]*-1","v":0},"X",{"$f":"Tabelle3[[#This Row],[Menge\n    *)]]*-1","v":0},{"$f":"Tabelle3[[#This Row],[Menge\n    *)]]*-1","v":0},"X","X",{"$f":"Tabelle3[[#This Row],[Menge\n    *)]]*-1","v":0},"X","X","X","X","X","X","X","X"]
[null,null,null,null,"651G8005",0,"GRAFENTHAL HDD 600GB 10K 2.5\\ SAS 12GB/S\""," "," ",null,null,"X","X",{"$f":"Tabelle3[[#This Row],[Menge\n    *)]]*-1","v":0},{"$f":"Tabelle3[[#This Row],[Menge\n    *)]]*-1","v":0},"X",{"$f":"Tabelle3[[#This Row],[Menge\n    *)]]*-1","v":0},{"$f":"Tabelle3[[#This Row],[Menge\n    *)]]*-1","v":0},"X","X",{"$f":"Tabelle3[[#This Row],[Menge\n    *)]]*-1","v":0},"X","X","X","X","X","X","X","X"]
[null,null,null,null,"651G8006",0,"GRAFENTHAL HDD 900GB 10K 2.5\\ SAS 12GB/S\""," "," ",null,null,"X","X",{"$f":"Tabelle3[[#This Row],[Menge\n    *)]]*-1","v":0},{"$f":"Tabelle3[[#This Row],[Menge\n    *)]]*-1","v":0},"X",{"$f":"Tabelle3[[#This Row],[Menge\n    *)]]*-1","v":0},{"$f":"Tabelle3[[#This Row],[Menge\n    *)]]*-1","v":0},"X","X",{"$f":"Tabelle3[[#This Row],[Menge\n    *)]]*-1","v":0},"X","X","X","X","X","X","X","X"]
[null,null,null,null,"651G8007",0,"GRAFENTHAL HDD 1.2TB 10K 2.5\\ SAS 12GB/S\""," "," ",null,null,"X","X",{"$f":"Tabelle3[[#This Row],[Menge\n    *)]]*-1","v":0},{"$f":"Tabelle3[[#This Row],[Menge\n    *)]]*-1","v":0},"X",{"$f":"Tabelle3[[#This Row],[Menge\n    *)]]*-1","v":0},{"$f":"Tabelle3[[#This Row],[Menge\n    *)]]*-1","v":0},"X","X",{"$f":"Tabelle3[[#This Row],[Menge\n    *)]]*-1","v":0},"X","X","X","X","X","X","X","X"]
[null,null,null,null,"651G8021",0,"GRAFENTHAL HDD 1.8TB 10K 2.5'' SAS","12GB/S"," ",null,null,"X","X",{"$f":"Tabelle3[[#This Row],[Menge\n    *)]]*-1","v":0},{"$f":"Tabelle3[[#This Row],[Menge\n    *)]]*-1","v":0},"X",{"$f":"Tabelle3[[#This Row],[Menge\n    *)]]*-1","v":0},{"$f":"Tabelle3[[#This Row],[Menge\n    *)]]*-1","v":0},"X","X",{"$f":"Tabelle3[[#This Row],[Menge\n    *)]]*-1","v":0},"X","X","X","X","X","X","X","X"]
[null,null,null,null,"651G8022",0,"GRAFENTHAL HDD 2.4TB 10K 2.5'' SAS","12GB/S"," ",null,null,"X","X",{"$f":"Tabelle3[[#This Row],[Menge\n    *)]]*-1","v":0},{"$f":"Tabelle3[[#This Row],[Menge\n    *)]]*-1","v":0},"X",{"$f":"Tabelle3[[#This Row],[Menge\n    *)]]*-1","v":0},{"$f":"Tabelle3[[#This Row],[Menge\n    *)]]*-1","v":0},"X","X",{"$f":"Tabelle3[[#This Row],[Menge\n    *)]]*-1","v":0},"X","X","X","X","X","X","X","X"]
[null,null,null,null,"SAS 2,5\" 15k 12GB/s",{"$f":"SUM(F52:F54)","v":0}]
[null,null,null,null,"651G8003",0,"GRAFENTHAL HDD 300GB 15K 2.5\\ SAS 12GB/S\""," "," ",null,null,"X","X",{"$f":"Tabelle3[[#This Row],[Menge\n    *)]]*-1","v":0},{"$f":"Tabelle3[[#This Row],[Menge\n    *)]]*-1","v":0},"X",{"$f":"Tabelle3[[#This Row],[Menge\n    *)]]*-1","v":0},{"$f":"Tabelle3[[#This Row],[Menge\n    *)]]*-1","v":0},"X","X",{"$f":"Tabelle3[[#This Row],[Menge\n    *)]]*-1","v":0},"X","X","X","X","X","X","X","X"]
[null,null,null,null,"651G8004",0,"GRAFENTHAL HDD 600GB 15K 2.5\\ SAS 12GB/S\""," "," ",null,null,"X","X",{"$f":"Tabelle3[[#This Row],[Menge\n    *)]]*-1","v":0},{"$f":"Tabelle3[[#This Row],[Menge\n    *)]]*-1","v":0},"X",{"$f":"Tabelle3[[#This Row],[Menge\n    *)]]*-1","v":0},{"$f":"Tabelle3[[#This Row],[Menge\n    *)]]*-1","v":0},"X","X",{"$f":"Tabelle3[[#This Row],[Menge\n    *)]]*-1","v":0},"X","X","X","X","X","X","X","X"]
[null,null,null,null,"651G8019",0,"GRAFENTHAL HDD 900GB 15K 2.5'' SAS","12GB/S"," ",null,null,"X","X",{"$f":"Tabelle3[[#This Row],[Menge\n    *)]]*-1","v":0},{"$f":"Tabelle3[[#This Row],[Menge\n    *)]]*-1","v":0},"X",{"$f":"Tabelle3[[#This Row],[Menge\n    *)]]*-1","v":0},{"$f":"Tabelle3[[#This Row],[Menge\n    *)]]*-1","v":0},"X","X",{"$f":"Tabelle3[[#This Row],[Menge\n    *)]]*-1","v":0},"X","X","X","X","X","X","X","X"]
[null,null,null,null,"SAS SSD  12GB/s",{"$f":"SUM(F56:F59)","v":0}]
[null,null,null,null,"651G7004",0,"GRAFENTHAL SSD 480GB 2,5'' SAS 12GB/S","MIDRANGE DWPD 1"," ",null,null,"X","X",{"$f":"Tabelle3[[#This Row],[Menge\n    *)]]*-1","v":0},{"$f":"Tabelle3[[#This Row],[Menge\n    *)]]*-1","v":0},"X",{"$f":"Tabelle3[[#This Row],[Menge\n    *)]]*-1","v":0},{"$f":"Tabelle3[[#This Row],[Menge\n    *)]]*-1","v":0},"X","X",{"$f":"Tabelle3[[#This Row],[Menge\n    *)]]*-1","v":0},"X","X","X","X","X","X","X","X"]
[null,null,null,null,"651G7005",0,"GRAFENTHAL SSD 960GB 2,5'' SAS 12GB/S","MIDRANGE DWPD 1"," ",null,null,"X","X",{"$f":"Tabelle3[[#This Row],[Menge\n    *)]]*-1","v":0},{"$f":"Tabelle3[[#This Row],[Menge\n    *)]]*-1","v":0},"X",{"$f":"Tabelle3[[#This Row],[Menge\n    *)]]*-1","v":0},{"$f":"Tabelle3[[#This Row],[Menge\n    *)]]*-1","v":0},"X","X",{"$f":"Tabelle3[[#This Row],[Menge\n    *)]]*-1","v":0},"X","X","X","X","X","X","X","X"]
[null,null,null,null,"651G7006",0,"GRAFENTHAL SSD 1920GB 2,5'' SAS 12GB/S","MIDRANGE DWPD 1"," ",null,null,"X","X",{"$f":"Tabelle3[[#This Row],[Menge\n    *)]]*-1","v":0},{"$f":"Tabelle3[[#This Row],[Menge\n    *)]]*-1","v":0},"X",{"$f":"Tabelle3[[#This Row],[Menge\n    *)]]*-1","v":0},{"$f":"Tabelle3[[#This Row],[Menge\n    *)]]*-1","v":0},"X","X",{"$f":"Tabelle3[[#This Row],[Menge\n    *)]]*-1","v":0},"X","X","X","X","X","X","X","X"]
[null,null,null,null,"651G7007",0,"GRAFENTHAL SSD 3840GB 2,5'' SAS 12GB/S","MIDRANGE DWPD 1"," ",null,null,"X","X",{"$f":"Tabelle3[[#This Row],[Menge\n    *)]]*-1","v":0},{"$f":"Tabelle3[[#This Row],[Menge\n    *)]]*-1","v":0},"X",{"$f":"Tabelle3[[#This Row],[Menge\n    *)]]*-1","v":0},{"$f":"Tabelle3[[#This Row],[Menge\n    *)]]*-1","v":0},"X","X",{"$f":"Tabelle3[[#This Row],[Menge\n    *)]]*-1","v":0},"X","X","X","X","X","X","X","X"]
[null,null,null,null,"HDD Int",{"$f":"SUM(#REF!)","v":{"$error":"#REF!"}}]
[null,null,null,null,"SATA 3,5\" 7,2k 6GB/s",{"$f":"SUM(#REF!)","v":{"$error":"#REF!"}}]
[null,null,null,null,"SAS 3,5\" 7,2k  12GB/s",{"$f":"SUM(F63:F66)","v":0}]
[null,null,null,null,"651G6020",0,"GRAFENTHAL HDD 4TB SAS 7,2K 3,5“ 12GB/S","24/7","MTTF 2.5M HOURS",null,null,"X","X","X","X","X","X","X",{"$f":"Tabelle3[[#This Row],[Menge\n    *)]]*-1","v":0},{"$f":"Tabelle3[[#This Row],[Menge\n    *)]]*-1","v":0},{"$f":"Tabelle3[[#This Row],[Menge\n    *)]]*-1","v":0},{"$f":"Tabelle3[[#This Row],[Menge\n    *)]]*-1","v":0},{"$f":"Tabelle3[[#This Row],[Menge\n    *)]]*-1","v":0},"X","X","X","X","X","X"]
[null,null,null,null,"651G6019",0,"HDD 6TB SAS 7,2K 3,5“ 12GB/S 24/7","FOR GRAFENTHAL SERVER","MTTF 2.5M HOURS",null,null,"X","X","X","X","X","X","X",{"$f":"Tabelle3[[#This Row],[Menge\n    *)]]*-1","v":0},{"$f":"Tabelle3[[#This Row],[Menge\n    *)]]*-1","v":0},{"$f":"Tabelle3[[#This Row],[Menge\n    *)]]*-1","v":0},{"$f":"Tabelle3[[#This Row],[Menge\n    *)]]*-1","v":0},{"$f":"Tabelle3[[#This Row],[Menge\n    *)]]*-1","v":0},"X","X","X","X","X","X"]
[null,null,null,null,"651G6018",0,"HDD 8TB SAS 7,2K 3,5“ 12GB/S 24/7","FOR GRAFENTHAL SERVER","MTTF 2.5M HOURS",null,null,"X","X","X","X","X","X","X",{"$f":"Tabelle3[[#This Row],[Menge\n    *)]]*-1","v":0},{"$f":"Tabelle3[[#This Row],[Menge\n    *)]]*-1","v":0},{"$f":"Tabelle3[[#This Row],[Menge\n    *)]]*-1","v":0},{"$f":"Tabelle3[[#This Row],[Menge\n    *)]]*-1","v":0},{"$f":"Tabelle3[[#This Row],[Menge\n    *)]]*-1","v":0},"X","X","X","X","X","X"]
[null,null,null,null,"651G6016",0,"HDD 10TB SAS 7,2K 3,5“ 12GB/S 24/7","FOR GRAFENTHAL SERVER","MTTF 2.5M HOURS",null,null,"X","X","X","X","X","X","X",{"$f":"Tabelle3[[#This Row],[Menge\n    *)]]*-1","v":0},{"$f":"Tabelle3[[#This Row],[Menge\n    *)]]*-1","v":0},{"$f":"Tabelle3[[#This Row],[Menge\n    *)]]*-1","v":0},{"$f":"Tabelle3[[#This Row],[Menge\n    *)]]*-1","v":0},{"$f":"Tabelle3[[#This Row],[Menge\n    *)]]*-1","v":0},"X","X","X","X","X","X"]
[null,null,null,null,"HDD Int M.2NVMe",{"$f":"SUM(F68)","v":0}]
[null,null,null,null,"651G7000",0,"GRAFENTHAL SSD 512GB NVME M.2","PCIe 3.0 x4 READ 3500MB/S WRITE 2100MB/S"," ",null,null,"X","X","X","X","X","X","X","X","X","X","X","X","X",{"$f":"Tabelle3[[#This Row],[Menge\n    *)]]*-1","v":0},{"$f":"Tabelle3[[#This Row],[Menge\n    *)]]*-1","v":0},"X","X","X"]
[null,null,null,null,"651G7001",0,"GRAFENTHAL SSD 1TB NVME M.2","PCIe 3.0 x4 READ 3500MB/S WRITE 2100MB/S"," ",null,null,"X","X","X","X","X","X","X","X","X","X","X","X","X",{"$f":"Tabelle3[[#This Row],[Menge\n    *)]]*-1","v":0},{"$f":"Tabelle3[[#This Row],[Menge\n    *)]]*-1","v":0},"X","X","X"]
[null,null,null,null,"651G7002",0,"GRAFENTHAL SSD 2TB NVME M.2","PCIe 3.0 x4 READ 3500MB/S WRITE 2100MB/S"," ",null,null,"X","X","X","X","X","X","X","X","X","X","X","X","X",{"$f":"Tabelle3[[#This Row],[Menge\n    *)]]*-1","v":0},{"$f":"Tabelle3[[#This Row],[Menge\n    *)]]*-1","v":0},"X","X","X"]
[null,null,null,"+","HDD Int M.2 SATA",{"$f":"SUM(F75)","v":0}]
[null,null,null,"+","651G8000",0,"GRAFENTHAL SSD 256GB M.2 2280 SATA 6GB/S","256BIT-AES MTBF 1.6M HOURS TBW 144TB"," ",null,null,"X","X","X","X","X","X","X","X","X","X","X","X","X",{"$f":"Tabelle3[[#This Row],[Menge\n    *)]]*-1","v":0},{"$f":"Tabelle3[[#This Row],[Menge\n    *)]]*-1","v":0},"X","X","X"]
[null,null,null,"+","651G8001",0,"GRAFENTHAL SSD 512GB M.2 2280 SATA 6GB/S","256BIT-AES MTBF 1.6M HOURS TBW 288TB"," ",null,null,"X","X","X","X","X","X","X","X","X","X","X","X","X",{"$f":"Tabelle3[[#This Row],[Menge\n    *)]]*-1","v":0},{"$f":"Tabelle3[[#This Row],[Menge\n    *)]]*-1","v":0},"X","X","X"]
[null,null,null,"+","651G8002",0,"GRAFENTHAL SSD 1TB M.2 2280 SATA 6GB/S","256BIT-AES TCG OPAL 2.0 MTBF 1.5M HOURS"," ",null,null,"X","X","X","X","X","X","X","X","X","X","X","X","X",{"$f":"Tabelle3[[#This Row],[Menge\n    *)]]*-1","v":0},{"$f":"Tabelle3[[#This Row],[Menge\n    *)]]*-1","v":0},"X","X","X"]
[null,null,null,null,"DVD",{"$f":"SUM(F76)","v":0}]
[null,null,null,null,"658G0002",0,"GRAFENTHAL DRIVE DVD-RW SATA","INTERN SLIM BLACK"," ",null,null,"X","X","X","X","X","X","X","X","X","X","X","X","X","X","X","X","X",{"$f":"Tabelle3[[#This Row],[Menge\n    *)]]*-1","v":0}]
[null,null,null,null,"Raid Controller",{"$f":"SUM(F80:F82)","v":0}]
[null,null,null,null,"653G5004",0,"GRAFENTHAL RAID CONTROLLER SAS/SATA","12Gb/s/6GB/s 4i 1GB CACHE PCIe 3.0 x8","RAID 0 1 5 6 10 50 60 TYP 9361-4I",null,null,null,null,null,null,null,null,null,null,null,{"$f":"Tabelle3[[#This Row],[Menge\n    *)]]*4","v":0},null,null,null,{"$f":"Tabelle3[[#This Row],[Menge\n    *)]]*-1","v":0},{"$f":"Tabelle3[[#This Row],[Menge\n    *)]]*-1","v":0},{"$f":"Tabelle3[[#This Row],[Menge\n    *)]]*-1","v":0}]
[null,null,null,null,"653G5007",0,"GRAFENTHAL RAID CONTROLLER SAS/SATA","12GB/S /6GB/S 8i 1GB CACHE","RAID 0 1  5 6 10 50 60 TYP 9361-8I",null,null,null,null,null,null,null,null,null,null,null,{"$f":"Tabelle3[[#This Row],[Menge\n    *)]]*8","v":0},null,null,null,{"$f":"Tabelle3[[#This Row],[Menge\n    *)]]*-1","v":0},{"$f":"Tabelle3[[#This Row],[Menge\n    *)]]*-1","v":0},{"$f":"Tabelle3[[#This Row],[Menge\n    *)]]*-1","v":0}]
[null,null,null,null,"653G7004",0,"GRAFENTHAL MEGARAID 9341-4i CONTROLLER","SATA 6GB/S SAS 12GB/S PCIe 3.0 x8","RAID 0 1 5 10 50 TYP 9341-4I",null,null,"X","X","X","X","X","X","X","X","X",{"$f":"Tabelle3[[#This Row],[Menge\n    *)]]*4","v":0},"X","X","X",{"$f":"Tabelle3[[#This Row],[Menge\n    *)]]*-1","v":0},{"$f":"Tabelle3[[#This Row],[Menge\n    *)]]*-1","v":0},{"$f":"Tabelle3[[#This Row],[Menge\n    *)]]*-1","v":0},"X","X"]
[null,null,null,null,"653G5008",0,"GRAFENTHAL RAID CONTROLLER SAS/SATA","12GB/S /6GB/S 8i NO CACHE"," ",null,null,"X","X","X","X","X","X","X","X","X",{"$f":"Tabelle3[[#This Row],[Menge\n    *)]]*8","v":0},"X","X","X",{"$f":"Tabelle3[[#This Row],[Menge\n    *)]]*-1","v":0},{"$f":"Tabelle3[[#This Row],[Menge\n    *)]]*-1","v":0},{"$f":"Tabelle3[[#This Row],[Menge\n    *)]]*-1","v":0},"X","X"]
[null,null,null,null,"653G6002",{"$f":"SUM(F79,F81)*2+SUM(F80,F78)","v":0},"GRAFENTHAL CABLE 0,5M","SFF-8643 TO 4x S-ATA"," ",null,null,"X","X","X","X","X","X","X","X","X","X","X","X","X","X","X","X","X","X"]
[null,null,null,null,"653G5903",0,"GRAFENTHAL CACHEVAULT FLASH CACHE","PROTECTION MODULE FOR RAID CTR"," "]
[null,null,null,null,"653G7001",0,"GRAFENTHAL MEGARAID CACHECADE PRO 2.0","PHYSICAL KEY SSD CACHE ENABLER"," "]
[null,null,null,null,"HBA SAS",{"$f":"SUM(F86:F89)","v":0}]
[null,null,null,null,"659G4013",0,"GRAFENTHAL EXTERNAL SAS CABLE 1M","MINI MULTILANE SFF-8088 TO SFF-8644"," ",null,null,"X","X","X","X","X","X","X","X","X","X","X","X","X","X","X","X","X","X"]
[null,null,null,null,"653G7006",0,"GRAFENTHAL EXTERNAL SAS CABLE 2M","SFF-8644 TO SFF-8644"," ",null,null,"X","X","X","X","X","X","X","X","X","X","X","X","X","X","X","X","X","X"]
[null,null,null,null,"653G7007",0,"GRAFENTHAL EXTERNAL SAS CABLE 1M","SFF-8644 TO SFF-8644"," ",null,null,"X","X","X","X","X","X","X","X","X","X","X","X","X","X","X","X","X","X"]
[null,null,null,null,"653G6005",0,"GRAFENTHAL HBA SAS/SATA 12Gb/s 9300-4i4e"," "," ",null,null,"X","X","X","X","X","X","X","X","X","X","X","X","X",{"$f":"Tabelle3[[#This Row],[Menge\n    *)]]*-1","v":0},{"$f":"Tabelle3[[#This Row],[Menge\n    *)]]*-1","v":0},{"$f":"Tabelle3[[#This Row],[Menge\n    *)]]*-1","v":0},"X","X"]
[null,null,null,null,"(Kupfer-) Netzkarte",{"$f":"SUM(F91:F91)","v":0}]
[null,null,null,null,"659G8015",0,"GRAFENTHAL GIGABIT ETHERNET APDATER","I350-T4V2 4x RJ-45 PCIe x4 COPPER"," ",null,null,"X","X","X","X","X","X","X","X","X","X","X","X","X",{"$f":"Tabelle3[[#This Row],[Menge\n    *)]]*-1","v":0},{"$f":"Tabelle3[[#This Row],[Menge\n    *)]]*-1","v":0},"X","X","X"]
[null,null,null,null,"Glasfaserkarten",{"$f":"SUM(F93:F94)","v":0}]
[null,null,null,null,"659G7000",0,"GRAFENTHAL QLOGIC HBA FC SINGLE PORT","16GB/S PCIe 3.0 x8"," ",null,null,"X","X","X","X","X","X","X","X","X","X","X","X","X",{"$f":"Tabelle3[[#This Row],[Menge\n    *)]]*-1","v":0},{"$f":"Tabelle3[[#This Row],[Menge\n    *)]]*-1","v":0},{"$f":"Tabelle3[[#This Row],[Menge\n    *)]]*-1","v":0},"X","X"]
[null,null,null,null,"659G7001",0,"GRAFENTHAL QLOGIC HBA FC DUAL PORT","16GB/S PCIe 3.0 x8"," ",null,null,"X","X","X","X","X","X","X","X","X","X","X","X","X",{"$f":"Tabelle3[[#This Row],[Menge\n    *)]]*-1","v":0},{"$f":"Tabelle3[[#This Row],[Menge\n    *)]]*-1","v":0},{"$f":"Tabelle3[[#This Row],[Menge\n    *)]]*-1","v":0},"X","X"]
[null,null,null,null,"SFP+"]
[null,null,null,null,"653G7003",0,"GRAFENTHAL ETHERNET ADAPTER 2-PORT 10GBE","INTEL X520 FIBRE SFP+ PCIe x8 LP"," ",null,null,null,null,null,null,null,null,null,null,null,null,null,null,null,{"$f":"Tabelle3[[#This Row],[Menge\n    *)]]*-1","v":0},{"$f":"Tabelle3[[#This Row],[Menge\n    *)]]*-1","v":0},{"$f":"Tabelle3[[#This Row],[Menge\n    *)]]*-1","v":0}]
[null,null,null,null,"Grafikkarte",{"$f":"SUM(#REF!)","v":{"$error":"#REF!"}}]
[null,null,null,null,"Betriebssysteme",{"$f":"SUM(F99:F100)","v":0}]
[null,null,null,null,"655G3002",0,"GRAFENTHAL WINDOWS SERVER 2012 R2","ESSENTIALS LIZENZ UND MEDIEN 1-2 CPU"," ",null,null,"X","X","X","X","X","X","X","X","X","X","X","X","X","X","X","X","X","X"]
[null,null,null,null,"655G3003",0,"GRAFENTHAL WINDOWS SERVER 2012 R2","STANDARD LIZENZ UND MEDIEN 2 CPU"," ",null,null,"X","X","X","X","X","X","X","X","X","X","X","X","X","X","X","X","X","X"]
[null,null,null,null,"P73-07115",0,"MICROSOFT WINDOWS SERVER 2016 STANDARD","64BIT 16C"," "]
[null,null,null,null,"Open-E",{"$f":"SUM(F103:F114)","v":0}]
[null,null,null,null,1701,0,"OPEN-E DSS V7 STORAGE SOFTWARE OS, 4TB"," ",null,null,null,"X","X","X","X","X","X","X","X","X","X","X","X","X","X","X","X","X","X"]
[null,null,null,null,1702,0,"OPEN-E DSS V7 STORAGE SOFTWARE OS, 8TB"," ",null,null,null,"X","X","X","X","X","X","X","X","X","X","X","X","X","X","X","X","X","X"]
[null,null,null,null,1703,0,"OPEN-E DSS V7 STORAGE SOFTWARE OS, 16TB"," ",null,null,null,"X","X","X","X","X","X","X","X","X","X","X","X","X","X","X","X","X","X"]
[null,null,null,null,1704,0,"OPEN-E DSS V7 STORAGE SOFTWARE OS,","UNLIMITED TB",null,null,null,"X","X","X","X","X","X","X","X","X","X","X","X","X","X","X","X","X","X"]
[null,null,null,null,1719,0,"OPEN-E FEATURE PACK-ACTIVE iSCSI,","FAILOVER V7 ONLY TWO LICENSE KEY",null,null,null,"X","X","X","X","X","X","X","X","X","X","X","X","X","X","X","X","X","X"]
[null,null,null,null,1775,0,"OPEN-E STANDARD SUPPORT, 1 YEAR,","8 BUSINESS HR PHONE OR EMAIL",null,null,null,"X","X","X","X","X","X","X","X","X","X","X","X","X","X","X","X","X","X"]
[null,null,null,null,1776,0,"OPEN-E PREMIUM SUPPORT, 1 YEAR","4 BUSINESS HR PHONE EMAIL REMOTE CONSOLE",null,null,null,"X","X","X","X","X","X","X","X","X","X","X","X","X","X","X","X","X","X"]
[null,null,null,null,1777,0,"OPEN-E 24/7 SUPPORT,3 YEARS,4 BUSI. HR.","UP TO 4H AFTER SUBMISSION OF TICKET",null,null,null,"X","X","X","X","X","X","X","X","X","X","X","X","X","X","X","X","X","X"]
[null,null,null,null,1778,0,"OPEN-E UPGRADE TO 3 YEARS BASIC SUPPORT"," ",null,null,null,"X","X","X","X","X","X","X","X","X","X","X","X","X","X","X","X","X","X"]
[null,null,null,null,1779,0,"OPEN-E UPGRADE TO 3 YEARS STANDARD","SUPPORT",null,null,null,"X","X","X","X","X","X","X","X","X","X","X","X","X","X","X","X","X","X"]
[null,null,null,null,1780,0,"OPEN-E UPGRADE TO 3 YEARS PREMIUM","SUPPORT",null,null,null,"X","X","X","X","X","X","X","X","X","X","X","X","X","X","X","X","X","X"]
[null,null,null,null,1781,0,"OPEN-E 24/7 SUPPORT,3 YEARS,4 BUSI. HR.","UP TO 4H AFTER SUBMISSION OF TICKET",null,null,null,"X","X","X","X","X","X","X","X","X","X","X","X","X","X","X","X","X","X"]
[null,null,null,null,"MPAC",{"$f":"SUM(#REF!)","v":{"$error":"#REF!"}}]
[null,null,null,null,"740M6139",0,"GRAFENTHAL MPAC VOR ORT SERVICE UPGRADE","3 JAHRE 13x5 24 STD WIEDERHERSTELLUNG","FÜR GRAFENTHAL T1004 S2",null,null,"X","X","X","X","X","X","X","X","X","X","X","X","X","X","X","X","X","X"]
[null,null,null,null,"740M6140",0,"GRAFENTHAL MPAC VOR ORT SERVICE UPGRADE","3 JAHRE 13x5 12 STD WIEDERHERSTELLUNG","FÜR GRAFENTHAL T1004 S2",null,null,"X","X","X","X","X","X","X","X","X","X","X","X","X","X","X","X","X","X"]
[null,null,null,null,"740M6141",0,"GRAFENTHAL MPAC VOR ORT SERVICE UPGRADE","3 JAHRE 24x7 6 STD WIEDERHERSTELLUNG","FÜR GRAFENTHAL T1004 S2",null,null,"X","X","X","X","X","X","X","X","X","X","X","X","X","X","X","X","X","X"]
[null,null,null,null,"740M6142",0,"GRAFENTHAL MPAC VOR ORT SERVICE UPGRADE","4 JAHRE 13x5 24 STD WIEDERHERSTELLUNG","FÜR GRAFENTHAL T1004 S2",null,null,"X","X","X","X","X","X","X","X","X","X","X","X","X","X","X","X","X","X"]
[null,null,null,null,"740M6143",0,"GRAFENTHAL MPAC VOR ORT SERVICE UPGRADE","4 JAHRE 13x5 12 STD WIEDERHERSTELLUNG","FÜR GRAFENTHAL T1004 S2",null,null,"X","X","X","X","X","X","X","X","X","X","X","X","X","X","X","X","X","X"]
[null,null,null,null,"740M6144",0,"GRAFENTHAL MPAC VOR ORT SERVICE UPGRADE","4 JAHRE 24x7 6 STD WIEDERHERSTELLUNG","FÜR GRAFENTHAL T1004 S2",null,null,"X","X","X","X","X","X","X","X","X","X","X","X","X","X","X","X","X","X"]
[null,null,null,null,"740M6145",0,"GRAFENTHAL MPAC VOR ORT SERVICE UPGRADE","5 JAHRE 13x5 24 STD WIEDERHERSTELLUNG","FÜR GRAFENTHAL T1004 S2",null,null,"X","X","X","X","X","X","X","X","X","X","X","X","X","X","X","X","X","X"]
[null,null,null,null,"740M6146",0,"GRAFENTHAL MPAC VOR ORT SERVICE UPGRADE","5 JAHRE 13x5 12 STD WIEDERHERSTELLUNG","FÜR GRAFENTHAL T1004 S2",null,null,"X","X","X","X","X","X","X","X","X","X","X","X","X","X","X","X","X","X"]
[null,null,null,null,"740M6147",0,"GRAFENTHAL MPAC VOR ORT SERVICE UPGRADE","5 JAHRE 24x7 6 STD WIEDERHERSTELLUNG","FÜR GRAFENTHAL T1004 S2",null,null,"X","X","X","X","X","X","X","X","X","X","X","X","X","X","X","X","X","X"]
[null,null,null,null,"740M6148",0,"GRAFENTHAL MPAC VOR ORT SERVICE UPGRADE","3 JAHRE 13x5 24STD WIEDERHERSTELLUNG DMR","FÜR GRAFENTHAL T1004 S2",null,null,"X","X","X","X","X","X","X","X","X","X","X","X","X","X","X","X","X","X"]
[null,null,null,null,"740M6149",0,"GRAFENTHAL MPAC VOR ORT SERVICE UPGRADE","3 JAHRE 13x5 12STD WIEDERHERSTELLUNG DMR","FÜR GRAFENTHAL T1004 S2",null,null,"X","X","X","X","X","X","X","X","X","X","X","X","X","X","X","X","X","X"]
[null,null,null,null,"740M6151",0,"GRAFENTHAL MPAC VOR ORT SERVICE UPGRADE","4 JAHRE 13x5 24STD WIEDERHERSTELLUNG DMR","FÜR GRAFENTHAL T1004 S2",null,null,"X","X","X","X","X","X","X","X","X","X","X","X","X","X","X","X","X","X"]
[null,null,null,null,"740M6152",0,"GRAFENTHAL MPAC VOR ORT SERVICE UPGRADE","4 JAHRE 13x5 12STD WIEDERHERSTELLUNG DMR","FÜR GRAFENTHAL T1004 S2",null,null,"X","X","X","X","X","X","X","X","X","X","X","X","X","X","X","X","X","X"]
[null,null,null,null,"740M6153",0,"GRAFENTHAL MPAC VOR ORT SERVICE UPGRADE","4 JAHRE 24x7 6STD WIEDERHERSTELLUNG DMR","FÜR GRAFENTHAL T1004 S2",null,null,"X","X","X","X","X","X","X","X","X","X","X","X","X","X","X","X","X","X"]
[null,null,null,null,"740M6154",0,"GRAFENTHAL MPAC VOR ORT SERVICE UPGRADE","5 JAHRE 13x5 24STD WIEDERHERSTELLUNG DMR","FÜR GRAFENTHAL T1004 S2",null,null,"X","X","X","X","X","X","X","X","X","X","X","X","X","X","X","X","X","X"]
[null,null,null,null,"740M6155",0,"GRAFENTHAL MPAC VOR ORT SERVICE UPGRADE","5 JAHRE 13x5 12STD WIEDERHERSTELLUNG DMR","FÜR GRAFENTHAL T1004 S2",null,null,"X","X","X","X","X","X","X","X","X","X","X","X","X","X","X","X","X","X"]
[null,null,null,null,"740M6156",0,"GRAFENTHAL MPAC VOR ORT SERVICE UPGRADE","5 JAHRE 24x7 6 STD WIEDERHERSTELLUNG DMR","FÜR GRAFENTHAL T1004 S2",null,null,"X","X","X","X","X","X","X","X","X","X","X","X","X","X","X","X","X","X"]
[null,null,null,null,"CONFIG-TO-ORDER",{"$f":"SUM(F134:F137)","v":0}]
[null,null,null,null,"CTO",0,"HARDWARE ASSEMBLIERUNG",null,null,null,null,"X","X","X","X","X","X","X","X","X","X","X","X","X","X","X","X","X","X"]
[null,null,null,null,"CTO1",0,"HARDWARE ASSEMBLIERUNG & FIRMWARE UPDATE",null,null,null,null,"X","X","X","X","X","X","X","X","X","X","X","X","X","X","X","X","X","X"]
[null,null,null,null,"CTO2",0,"HARDWARE ASSEMBLIERUNG, FIRMWARE UPDATE & RAID EINRICHTUNG",null,null,null,null,"X","X","X","X","X","X","X","X","X","X","X","X","X","X","X","X","X","X"]
[null,null,null,null,"CTO3",0,"HARDWARE ASSEMBLIERUNG, FIRMWARE UPDATE, RAID EINRICHTUNG & OS INSTALLATION",null,null,null,null,"X","X","X","X","X","X","X","X","X","X","X","X","X","X","X","X","X","X"]
[null,null,null,null,"Maus, Tastatur"]
[null,null,null,null,"659G3001",0,"GRAFENTHAL TASTATUR MAUS SET WIRED"," "," ",null,null,"X","X","X","X","X","X","X","X","X","X","X","X","X","X","X","X","X","X"]
[null,null,null,null,"USB Drive"]
[null,null,null,null,"652G6004",0,"GRAFENTHAL USB 3.0 FLASH DRIVE","ULTRA FIT 64GB UP TO 150MB/S"," ",null,null,"X","X","X","X","X","X","X","X","X","X","X","X","X","X","X","X","X","X"]
[null,null,null,null,"USV- Systeme",{"$f":"SUM(F143:F144)","v":0}]
[null,null,null,null,"122G0075",0,"GRAFENTHAL USV ET-750 LINE INTERACTIVE","LCD USB AVR 750VA 480W PURE SINEWAVE","RJ11 8.3KG CE ROHS GERMAN",null,null,"X","X","X","X","X","X","X","X","X","X","X","X","X","X","X","X","X","X"]
[null,null,null,null,"122G0150",0,"GRAFENTHAL USV ET-1500 LINE INTERACTIVE","LCD USB AVR 1500VA 1050W PURE SINEWAVE","RJ11 11.6KG CE ROHS GERMAN",null,null,"X","X","X","X","X","X","X","X","X","X","X","X","X","X","X","X","X","X"]
[null,null,null,null,"SUMME",1,null,null,null,{"$f":"COUNTIF($J$146:$AC$146,\"<0\")","v":0}]
[null,null,null,null,null,null,null,null,null,{"$f":"SUM(J14:J144)","v":0},0,0,0,0,0,0,0,0,0,0,0,0,0,0,0,0,0,0,0]

{"sheet":"T2910 S2","index":3,"n_rows":190,"n_cols":33,"rows_kept":190,"cut":false,"hidden":false,"merged":[[0,4,0,8]]}
[null,null,null,null," Towerserver T2910 S2"]
[]
[null,null,null,null,null,null,null,"Intel® Xeon® E5-2600 v4 Produktfamilie mit bis zu 22 Kernen ","more Info"]
[null,null,null,null,null,null,null,"zwei hot-plug-fähige Netzteile (Option) "]
[null,null,null,null,null,null,null,"bis zu 1.024 GB DDR4-Speicher "]
[null,null,null,null,null,null,null,"10 hot-plug-fähige HDD / SSD "]
[null,null,null,null,null,null,null,"1 x M.2 Port NGFF 22110/2280/2260 ","* Felder werden automatisch ausgefüllt"]
[null,null,null,null,null,null,null,null,"*) \"Menge\" filtern um Konfiguration anzuzeigen"]
[]
[]
[null,null,null,null,"Konfigurator",null,{"$f":"'Revision Info'!B10","v":"Revision 15"}]
[null,null,null,null,"ART. NR.","Menge\n    *)","Bezeichnung","Bezeichnung II","Bezeichnung III","nicht kombinierbar","nicht konfigurierbar","CPU slots","MEM Slots","SSD Slots","HDD Slots HS 2.5","HDD Slots HS 3.5","HDD Slots HS SAS","HDD Slots HS SATA","HDD Slots NHS SAS","HDD Slots NHS SATA","SAS Ports","CacheCade","3,5 Slots","5,25 Slots","PCI x1 Slots","PCI x4 Slots","PCI x8 Slots","PCI x16 Slots","DVD Slot","PSU Slot","SAS Expander Slot","Bckpl Slot Rear","NVME Slot"]
[null,null,null,null,"Maschinentyp",{"$f":"SUM(F14)","v":0},null,null,null,"if (Kombi);-1;0","if Menge;-1;0","(Menge x Eigenschaft)","(Menge x Eigenschaft)","(Menge x Eigenschaft)","(Menge x Eigenschaft)","(Menge x Eigenschaft)","(Menge x Eigenschaft)","(Menge x Eigenschaft)","(Menge x Eigenschaft)","(Menge x Eigenschaft)","(Menge x Eigenschaft)","(Menge x Eigenschaft)","(Menge x Eigenschaft)","(Menge x Eigenschaft)","(Menge x Eigenschaft)","(Menge x Eigenschaft)","(Menge x Eigenschaft)","(Menge x Eigenschaft)","(Menge x Eigenschaft)","(Menge x Eigenschaft)","(Menge x Eigenschaft)","(Menge x Eigenschaft)","(Menge x Eigenschaft)"]
[null,null,null,null,"622G6006",0,"GRAFENTHAL CTO TOWER SERVER T2910 S2","2xE5-2600 V4 SOCKETS 16x MEM 8x 3,5''","2x 2,5'' KVM RED PSU (1/2)",null,null,{"$f":"Tabelle49[[#This Row],[Menge\n    *)]]*2","v":0},{"$f":"Tabelle49[[#This Row],[Menge\n    *)]]*0","v":0},{"$f":"Tabelle49[[#This Row],[Menge\n    *)]]*10","v":0},{"$f":"Tabelle49[[#This Row],[Menge\n    *)]]*10","v":0},{"$f":"Tabelle49[[#This Row],[Menge\n    *)]]*8","v":0},{"$f":"Tabelle49[[#This Row],[Menge\n    *)]]*0","v":0},{"$f":"Tabelle49[[#This Row],[Menge\n    *)]]*10","v":0},{"$f":"Tabelle49[[#This Row],[Menge\n    *)]]*0","v":0},{"$f":"Tabelle49[[#This Row],[Menge\n    *)]]*0","v":0},{"$f":"Tabelle49[[#This Row],[Menge\n    *)]]*0","v":0},{"$f":"Tabelle49[[#This Row],[Menge\n    *)]]*0","v":0},{"$f":"Tabelle49[[#This Row],[Menge\n    *)]]*0","v":0},{"$f":"Tabelle49[[#This Row],[Menge\n    *)]]*2","v":0},{"$f":"Tabelle49[[#This Row],[Menge\n    *)]]*0","v":0},{"$f":"Tabelle49[[#This Row],[Menge\n    *)]]*0","v":0},{"$f":"Tabelle49[[#This Row],[Menge\n    *)]]*0","v":0},{"$f":"Tabelle49[[#This Row],[Menge\n    *)]]*0","v":0},{"$f":"Tabelle49[[#This Row],[Menge\n    *)]]*1","v":0},{"$f":"Tabelle49[[#This Row],[Menge\n    *)]]*2","v":0},{"$f":"Tabelle49[[#This Row],[Menge\n    *)]]*0","v":0},{"$f":"Tabelle49[[#This Row],[Menge\n    *)]]*1","v":0},{"$f":"Tabelle49[[#This Row],[Menge\n    *)]]*1","v":0}]
[null,null,null,null,"Prozessor",{"$f":"SUM(F17:F27)","v":0}]
[null,null,null,null,"V4 Prozessoren",{"$f":"SUM(F17:F27)","v":0}]
[null,null,null,null,"656G6016",0,"GRAFENTHAL CPU XEON E5-2637 V4 4CORE","3,5Ghz LGA2011V3 15MB CACHE 8 THREADS"," ",{"$f":"IF(COUNTIF(F17:F27,\"<>0\")>1,-1,0)","v":0},"X",{"$f":"Tabelle49[[#This Row],[Menge\n    *)]]*-1","v":0},{"$f":"Tabelle49[[#This Row],[Menge\n    *)]]*8","v":0},"X","X","X","X","X","X","X","X","X","X","X",{"$f":"Tabelle49[[#This Row],[Menge\n    *)]]*6","v":0},{"$f":"Tabelle49[[#This Row],[Menge\n    *)]]*6","v":0},{"$f":"Tabelle49[[#This Row],[Menge\n    *)]]*6","v":0},{"$f":"Tabelle49[[#This Row],[Menge\n    *)]]*6","v":0},"X","X","X","X","X"]
[null,null,null,null,"656G6017",0,"GRAFENTHAL CPU XEON E5-2603 V4 6CORE","1,7Ghz LGA2011V3 15MB CACHE 6 THREADS"," ","X","X",{"$f":"Tabelle49[[#This Row],[Menge\n    *)]]*-1","v":0},{"$f":"Tabelle49[[#This Row],[Menge\n    *)]]*8","v":0},"X","X","X","X","X","X","X","X","X","X","X",{"$f":"Tabelle49[[#This Row],[Menge\n    *)]]*6","v":0},{"$f":"Tabelle49[[#This Row],[Menge\n    *)]]*6","v":0},{"$f":"Tabelle49[[#This Row],[Menge\n    *)]]*6","v":0},{"$f":"Tabelle49[[#This Row],[Menge\n    *)]]*6","v":0},"X","X","X","X","X"]
[null,null,null,null,"656G6018",0,"GRAFENTHAL CPU XEON E5-2609 V4 8CORE","1,7Ghz LGA2011V3 20MB CACHE 8 THREADS"," ","X","X",{"$f":"Tabelle49[[#This Row],[Menge\n    *)]]*-1","v":0},{"$f":"Tabelle49[[#This Row],[Menge\n    *)]]*8","v":0},"X","X","X","X","X","X","X","X","X","X","X",{"$f":"Tabelle49[[#This Row],[Menge\n    *)]]*6","v":0},{"$f":"Tabelle49[[#This Row],[Menge\n    *)]]*6","v":0},{"$f":"Tabelle49[[#This Row],[Menge\n    *)]]*6","v":0},{"$f":"Tabelle49[[#This Row],[Menge\n    *)]]*6","v":0},"X","X","X","X","X"]
[null,null,null,null,"656G6019",0,"GRAFENTHAL CPU XEON E5-2620 V4 8CORE","2,1GHz LGA2011V3 20MB CACHE 16 THREADS"," ","X","X",{"$f":"Tabelle49[[#This Row],[Menge\n    *)]]*-1","v":0},{"$f":"Tabelle49[[#This Row],[Menge\n    *)]]*8","v":0},"X","X","X","X","X","X","X","X","X","X","X",{"$f":"Tabelle49[[#This Row],[Menge\n    *)]]*6","v":0},{"$f":"Tabelle49[[#This Row],[Menge\n    *)]]*6","v":0},{"$f":"Tabelle49[[#This Row],[Menge\n    *)]]*6","v":0},{"$f":"Tabelle49[[#This Row],[Menge\n    *)]]*6","v":0},"X","X","X","X","X"]
[null,null,null,null,"656G6020",0,"GRAFENTHAL CPU XEON E5-2630v4 2.20GHz","10C 25MB 85W"," ","X","X",{"$f":"Tabelle49[[#This Row],[Menge\n    *)]]*-1","v":0},{"$f":"Tabelle49[[#This Row],[Menge\n    *)]]*8","v":0},"X","X","X","X","X","X","X","X","X","X","X",{"$f":"Tabelle49[[#This Row],[Menge\n    *)]]*6","v":0},{"$f":"Tabelle49[[#This Row],[Menge\n    *)]]*6","v":0},{"$f":"Tabelle49[[#This Row],[Menge\n    *)]]*6","v":0},{"$f":"Tabelle49[[#This Row],[Menge\n    *)]]*6","v":0},"X","X","X","X","X"]
[null,null,null,null,"656G6021",0,"GRAFENTHAL CPU XEON E5-2640 V4 10CORE","2,4Ghz LGA2011V3 25MB CACHE 20 THREADS"," ","X","X",{"$f":"Tabelle49[[#This Row],[Menge\n    *)]]*-1","v":0},{"$f":"Tabelle49[[#This Row],[Menge\n    *)]]*8","v":0},"X","X","X","X","X","X","X","X","X","X","X",{"$f":"Tabelle49[[#This Row],[Menge\n    *)]]*6","v":0},{"$f":"Tabelle49[[#This Row],[Menge\n    *)]]*6","v":0},{"$f":"Tabelle49[[#This Row],[Menge\n    *)]]*6","v":0},{"$f":"Tabelle49[[#This Row],[Menge\n    *)]]*6","v":0},"X","X","X","X","X"]
[null,null,null,null,"656G6022",0,"GRAFENTHAL CPU XEON E5-2650 V4 12CORE","2,2Ghz LGA2011V3 30MB CACHE 24 THREADS"," ","X","X",{"$f":"Tabelle49[[#This Row],[Menge\n    *)]]*-1","v":0},{"$f":"Tabelle49[[#This Row],[Menge\n    *)]]*8","v":0},"X","X","X","X","X","X","X","X","X","X","X",{"$f":"Tabelle49[[#This Row],[Menge\n    *)]]*6","v":0},{"$f":"Tabelle49[[#This Row],[Menge\n    *)]]*6","v":0},{"$f":"Tabelle49[[#This Row],[Menge\n    *)]]*6","v":0},{"$f":"Tabelle49[[#This Row],[Menge\n    *)]]*6","v":0},"X","X","X","X","X"]
[null,null,null,null,"656G6023",0,"GRAFENTHAL CPU XEON E5-2660 V4 14CORE","2,0Ghz LGA2011V3 35MB CACHE 28 THREADS"," ","X","X",{"$f":"Tabelle49[[#This Row],[Menge\n    *)]]*-1","v":0},{"$f":"Tabelle49[[#This Row],[Menge\n    *)]]*8","v":0},"X","X","X","X","X","X","X","X","X","X","X",{"$f":"Tabelle49[[#This Row],[Menge\n    *)]]*6","v":0},{"$f":"Tabelle49[[#This Row],[Menge\n    *)]]*6","v":0},{"$f":"Tabelle49[[#This Row],[Menge\n    *)]]*6","v":0},{"$f":"Tabelle49[[#This Row],[Menge\n    *)]]*6","v":0},"X","X","X","X","X"]
[null,null,null,null,"656G6024",0,"GRAFENTHAL CPU XEON E5-2680 V4 14CORE","2,40GHz LGA2011 35MB CACHE 28 THREADS"," ","X","X",{"$f":"Tabelle49[[#This Row],[Menge\n    *)]]*-1","v":0},{"$f":"Tabelle49[[#This Row],[Menge\n    *)]]*8","v":0},"X","X","X","X","X","X","X","X","X","X","X",{"$f":"Tabelle49[[#This Row],[Menge\n    *)]]*6","v":0},{"$f":"Tabelle49[[#This Row],[Menge\n    *)]]*6","v":0},{"$f":"Tabelle49[[#This Row],[Menge\n    *)]]*6","v":0},{"$f":"Tabelle49[[#This Row],[Menge\n    *)]]*6","v":0},"X","X","X","X","X"]
[null,null,null,null,"656G6025",0,"GRAFENTHAL CPU XEON E5-2690 V4 14CORE","2,6Ghz LGA2011V3 35MB CACHE 28 THREADS"," ","X","X",{"$f":"Tabelle49[[#This Row],[Menge\n    *)]]*-1","v":0},{"$f":"Tabelle49[[#This Row],[Menge\n    *)]]*8","v":0},"X","X","X","X","X","X","X","X","X","X","X",{"$f":"Tabelle49[[#This Row],[Menge\n    *)]]*6","v":0},{"$f":"Tabelle49[[#This Row],[Menge\n    *)]]*6","v":0},{"$f":"Tabelle49[[#This Row],[Menge\n    *)]]*6","v":0},{"$f":"Tabelle49[[#This Row],[Menge\n    *)]]*6","v":0},"X","X","X","X","X"]
[null,null,null,null,"656G6026",0,"GRAFENTHAL CPU XEON E5-2687W V4 12CORE","3.00GHz LGA2011 30MB CACHE 24 THREADS"," ","X","X",{"$f":"Tabelle49[[#This Row],[Menge\n    *)]]*-1","v":0},{"$f":"Tabelle49[[#This Row],[Menge\n    *)]]*8","v":0},"X","X","X","X","X","X","X","X","X","X","X",{"$f":"Tabelle49[[#This Row],[Menge\n    *)]]*6","v":0},{"$f":"Tabelle49[[#This Row],[Menge\n    *)]]*6","v":0},{"$f":"Tabelle49[[#This Row],[Menge\n    *)]]*6","v":0},{"$f":"Tabelle49[[#This Row],[Menge\n    *)]]*6","v":0},"X","X","X","X","X"]
[null,null,null,null,"Heatsink",{"$f":"SUM(F29)","v":0}]
[null,null,null,null,"659G6017",{"$f":"IF(OR(,SUM(F17:F27)>0),SUM(F17:F27)*1,0)","v":0},"GRAFENTHAL CPU COOLER 4U 150W","FOR T2910 S2 / W2910 S2"," ","X","X","X","X","X","X","X","X","X","X","X","X","X","X","X","X","X","X","X","X","X","X","X","X"]
[null,null,null,null,"Arbeitsspeicher",{"$f":"SUM(F31:F33)","v":0}]
[null,null,null,null,"652G7000",0,"GRAFENTHAL MEM 16GB DDR4 2400MHz RDIMM","PC4-19200 CL17 DUAL RANKED ECC"," ","X","X","X",{"$f":"Tabelle49[[#This Row],[Menge\n    *)]]*-1","v":0},"X","X","X","X","X","X","X","X","X","X","X","X","X","X","X","X","X","X","X","X"]
[null,null,null,null,"652G7001",0,"GRAFENTHAL MEM 16GB DDR4 2400MHz LRDIMM","PC4-19200L CL17 DUAL RANKED ECC"," ",null,null,null,{"$f":"Tabelle49[[#This Row],[Menge\n    *)]]*-1","v":0}]
[null,null,null,null,"652G6011",0,"GRAFENTHAL MEM 32GB DDR4-2400MHz RDIMM","PC4-19200 CL17 DUAL RANKED ECC"," ","X","X","X",{"$f":"Tabelle49[[#This Row],[Menge\n    *)]]*-1","v":0},"X","X","X","X","X","X","X","X","X","X","X","X","X","X","X","X","X","X","X","X"]
[null,null,null,null,"652G7002",0,"GRAFENTHAL MEM 32GB DDR4 2400MHz LRDIMM","PC4-19200L CL17 DUAL RANKED ECC"," ",null,null,null,{"$f":"Tabelle49[[#This Row],[Menge\n    *)]]*-1","v":0}]
[null,null,null,null,"SAS Expander",{"$f":"SUM(F36)","v":0},""]
[null,null,null,null,"653G5009",0,"GRAFENTHAL EXPANDER CARD SAS","6GB/S SAS 12GB/S 9x MINI-SAS 4i PORTS","UPTO 28 HDDs","X","X","X",null,null,null,null,{"$f":"Tabelle49[[#This Row],[Menge\n    *)]]*24","v":0},null,null,null,{"$f":"Tabelle49[[#This Row],[Menge\n    *)]]*24","v":0},null,null,null,{"$f":"Tabelle49[[#This Row],[Menge\n    *)]]*-1","v":0},{"$f":"Tabelle49[[#This Row],[Menge\n    *)]]*-1","v":0},{"$f":"Tabelle49[[#This Row],[Menge\n    *)]]*-1","v":0},{"$f":"Tabelle49[[#This Row],[Menge\n    *)]]*-1","v":0},null,null,{"$f":"Tabelle49[[#This Row],[Menge\n    *)]]*-1","v":0},null,"X"]
[null,null,null,null,"653G5011",{"$f":"F36*4","v":0},"GRAFENTHAL RAID CABLE MINI-SAS HD TO","MINI-SAS SFF-8643 TO SFF-8087 0.6M"," ","X","X","X","X","X","X","X","X","X","X","X","X","X","X","X","X","X","X","X","X","X","X","X","X"]
[null,null,null,null,"653G3003",{"$f":"F36*1","v":0},"GRAFENTHAL RAID CABLE MINI-SAS","(SFF-8087) TO 4x SATA 0.6M"," ","X","X","X","X","X","X","X","X","X","X","X","X","X","X","X","X","X","X","X","X","X","X","X","X"]
[null,null,null,null,"Festplatten",{"$f":"SUM(F41:F42,F44:F47,F49:F55,F57,F59:F63,F65:F70,F72:F74,F76:F79,F81:F83)","v":0},""]
[null,null,null,null,"SATA SSD 6GB/s *MIDRANGE*",{"$f":"SUM(F41:F42)","v":0}]
[null,null,null,null,"651G7011",0,"GRAFENTHAL SSD 240GB 2.5'' SATA 6GB/S","MIDRANGE 599 TBW"," ","X","X","X","X",{"$f":"Tabelle49[[#This Row],[Menge\n    *)]]*-1","v":0},{"$f":"Tabelle49[[#This Row],[Menge\n    *)]]*-1","v":0},"X","X",{"$f":"Tabelle49[[#This Row],[Menge\n    *)]]*-1","v":0},"X","X","X","X","X","X","X","X","X","X","X","X","X","X","X"]
[null,null,null,null,"651G7012",0,"GRAFENTHAL SSD 480GB 2.5'' SATA 6GB/S","MIDRANGE 945 TBW"," ","X","X","X","X",{"$f":"Tabelle49[[#This Row],[Menge\n    *)]]*-1","v":0},{"$f":"Tabelle49[[#This Row],[Menge\n    *)]]*-1","v":0},"X","X",{"$f":"Tabelle49[[#This Row],[Menge\n    *)]]*-1","v":0},"X","X","X","X","X","X","X","X","X","X","X","X","X","X","X"]
[null,null,null,null,"SATA SSD 6GB/s *ENTRY*",{"$f":"SUM(F44:F47)","v":0}]
[null,null,null,null,"651G8024",0,"GRAFENTHAL SSD 256GB SATA3 6GB/S 2.5''","MTBF 1.5M HOURS TBW 300TB"," ",null,null,null,null,{"$f":"Tabelle49[[#This Row],[Menge\n    *)]]*-1","v":0},{"$f":"Tabelle49[[#This Row],[Menge\n    *)]]*-1","v":0},null,null,null,"X"]
[null,null,null,null,"651G8025",0,"GRAFENTHAL SSD 512GB SATA3 6GB/S 2.5''","MTBF 1.5M HOURS TBW 300TB"," ",null,null,null,null,{"$f":"Tabelle49[[#This Row],[Menge\n    *)]]*-1","v":0},{"$f":"Tabelle49[[#This Row],[Menge\n    *)]]*-1","v":0},null,null,null,"X"]
[null,null,null,null,"651G8026",0,"GRAFENTHAL SSD 1TB SATA3 6GB/S 2.5''","MTBF 1.5M HOURS TBW 300TB"," ",null,null,null,null,{"$f":"Tabelle49[[#This Row],[Menge\n    *)]]*-1","v":0},{"$f":"Tabelle49[[#This Row],[Menge\n    *)]]*-1","v":0},null,null,null,"X"]
[null,null,null,null,"651G8027",0,"GRAFENTHAL SSD 2TB SATA3 6GB/S 2.5''","MTBF 1.5M HOURS TBW 300TB"," ",null,null,null,null,{"$f":"Tabelle49[[#This Row],[Menge\n    *)]]*-1","v":0},{"$f":"Tabelle49[[#This Row],[Menge\n    *)]]*-1","v":0},null,null,null,"X"]
[null,null,null,null,"SATA 3,5\" 7,2k HDD 6GB/s",{"$f":"SUM(F49:F55)","v":0}]
[null,null,null,null,"651G8012",0,"GRAFENTHAL HDD 12TB SATA 3.5'' 7.2K","6GB/S MTBF 2.5M HOURS 5Y WARRANTY"," ","X","X","X","X",{"$f":"Tabelle49[[#This Row],[Menge\n    *)]]*-1","v":0},{"$f":"Tabelle49[[#This Row],[Menge\n    *)]]*-1","v":0},{"$f":"Tabelle49[[#This Row],[Menge\n    *)]]*-1","v":0},"X",{"$f":"Tabelle49[[#This Row],[Menge\n    *)]]*-1","v":0},"X","X","X","X","X","X","X","X","X","X","X","X","X","X","X"]
[null,null,null,null,"651G8013",0,"GRAFENTHAL HDD 10TB SATA 3.5''","7.2K 6GB/S MTBF 2.5M HOURS 5Y WARRANTY"," ","X","X","X","X",{"$f":"Tabelle49[[#This Row],[Menge\n    *)]]*-1","v":0},{"$f":"Tabelle49[[#This Row],[Menge\n    *)]]*-1","v":0},{"$f":"Tabelle49[[#This Row],[Menge\n    *)]]*-1","v":0},"X",{"$f":"Tabelle49[[#This Row],[Menge\n    *)]]*-1","v":0},"X","X","X","X","X","X","X","X","X","X","X","X","X","X","X"]
[null,null,null,null,"651G8014",0,"GRAFENTHAL HDD 8TB SATA 3.5''","7.2K 6GB/S MTBF 2.5M HOURS 5Y WARRANTY"," ","X","X","X","X",{"$f":"Tabelle49[[#This Row],[Menge\n    *)]]*-1","v":0},{"$f":"Tabelle49[[#This Row],[Menge\n    *)]]*-1","v":0},{"$f":"Tabelle49[[#This Row],[Menge\n    *)]]*-1","v":0},"X",{"$f":"Tabelle49[[#This Row],[Menge\n    *)]]*-1","v":0},"X","X","X","X","X","X","X","X","X","X","X","X","X","X","X"]
[null,null,null,null,"651G8015",0,"GRAFENTHAL HDD 6TB SATA 3.5''","7.2K 6GB/S MTBF 2.5M HOURS 5Y WARRANTY"," ","X","X","X","X",{"$f":"Tabelle49[[#This Row],[Menge\n    *)]]*-1","v":0},{"$f":"Tabelle49[[#This Row],[Menge\n    *)]]*-1","v":0},{"$f":"Tabelle49[[#This Row],[Menge\n    *)]]*-1","v":0},"X",{"$f":"Tabelle49[[#This Row],[Menge\n    *)]]*-1","v":0},"X","X","X","X","X","X","X","X","X","X","X","X","X","X","X"]
[null,null,null,null,"651G8016",0,"GRAFENTHAL HDD 4TB SATA 3.5''","7.2K 6GB/S MTBF 2.5M HOURS 5Y WARRANTY"," ","X","X","X","X",{"$f":"Tabelle49[[#This Row],[Menge\n    *)]]*-1","v":0},{"$f":"Tabelle49[[#This Row],[Menge\n    *)]]*-1","v":0},{"$f":"Tabelle49[[#This Row],[Menge\n    *)]]*-1","v":0},"X",{"$f":"Tabelle49[[#This Row],[Menge\n    *)]]*-1","v":0},"X","X","X","X","X","X","X","X","X","X","X","X","X","X","X"]
[null,null,null,null,"651G8017",0,"GRAFENTHAL HDD 2TB SATA 3.5''","7.2K 6GB/S MTBF 2.5M HOURS 5Y WARRANTY"," ","X","X","X","X",{"$f":"Tabelle49[[#This Row],[Menge\n    *)]]*-1","v":0},{"$f":"Tabelle49[[#This Row],[Menge\n    *)]]*-1","v":0},{"$f":"Tabelle49[[#This Row],[Menge\n    *)]]*-1","v":0},"X",{"$f":"Tabelle49[[#This Row],[Menge\n    *)]]*-1","v":0},"X","X","X","X","X","X","X","X","X","X","X","X","X","X","X"]
[null,null,null,null,"651G8018",0,"GRAFENTHAL HDD 1TB SATA 3.5''","7.2K 6GB/S MTBF 2.5M HOURS 5Y WARRANTY"," ","X","X","X","X",{"$f":"Tabelle49[[#This Row],[Menge\n    *)]]*-1","v":0},{"$f":"Tabelle49[[#This Row],[Menge\n    *)]]*-1","v":0},{"$f":"Tabelle49[[#This Row],[Menge\n    *)]]*-1","v":0},"X",{"$f":"Tabelle49[[#This Row],[Menge\n    *)]]*-1","v":0},"X","X","X","X","X","X","X","X","X","X","X","X","X","X","X"]
[null,null,null,null,"SATA 2,5\" 7.2k HDD 6GB/s",{"$f":"SUM(F57)","v":0}]
[null,null,null,null,"651G6002",0,"GRAFENTHAL HDD 1TB 2,5'' SATA 7200RPM","32MB CACHE 6GB/S BAUHÖHE 9.5MM","FUER SERVER UND WORKSTATION","X","X","X","X","X",{"$f":"Tabelle49[[#This Row],[Menge\n    *)]]*-1","v":0},"X","X","X","X","X","X","X","X","X","X","X","X","X","X","X","X","X","X"]
[null,null,null,null,"SAS 3,5\" 7.2k HDD 12GB/s",{"$f":"SUM(F59:F63)","v":0}]
[null,null,null,null,"651G6021",0,"HDD 2TB SAS 7,2K 3,5“ 12GB/S 24/7","FOR GRAFENTHAL SERVER","MTTF 2.5M HOURS","X","X","X","X",{"$f":"Tabelle49[[#This Row],[Menge\n    *)]]*-1","v":0},{"$f":"Tabelle49[[#This Row],[Menge\n    *)]]*-1","v":0},{"$f":"Tabelle49[[#This Row],[Menge\n    *)]]*-1","v":0},{"$f":"Tabelle49[[#This Row],[Menge\n    *)]]*-1","v":0},{"$f":"Tabelle49[[#This Row],[Menge\n    *)]]*-1","v":0},"X","X",{"$f":"Tabelle49[[#This Row],[Menge\n    *)]]*-1","v":0},"X","X","X","X","X","X","X","X","X","X","X","X"]
[null,null,null,null,"651G6020",0,"GRAFENTHAL HDD 4TB SAS 7,2K 3,5“ 12GB/S","24/7","MTTF 2.5M HOURS","X","X","X","X",{"$f":"Tabelle49[[#This Row],[Menge\n    *)]]*-1","v":0},{"$f":"Tabelle49[[#This Row],[Menge\n    *)]]*-1","v":0},{"$f":"Tabelle49[[#This Row],[Menge\n    *)]]*-1","v":0},{"$f":"Tabelle49[[#This Row],[Menge\n    *)]]*-1","v":0},{"$f":"Tabelle49[[#This Row],[Menge\n    *)]]*-1","v":0},"X","X",{"$f":"Tabelle49[[#This Row],[Menge\n    *)]]*-1","v":0},"X","X","X","X","X","X","X","X","X","X","X","X"]
[null,null,null,null,"651G6019",0,"HDD 6TB SAS 7,2K 3,5“ 12GB/S 24/7","FOR GRAFENTHAL SERVER","MTTF 2.5M HOURS","X","X","X","X",{"$f":"Tabelle49[[#This Row],[Menge\n    *)]]*-1","v":0},{"$f":"Tabelle49[[#This Row],[Menge\n    *)]]*-1","v":0},{"$f":"Tabelle49[[#This Row],[Menge\n    *)]]*-1","v":0},{"$f":"Tabelle49[[#This Row],[Menge\n    *)]]*-1","v":0},{"$f":"Tabelle49[[#This Row],[Menge\n    *)]]*-1","v":0},"X","X",{"$f":"Tabelle49[[#This Row],[Menge\n    *)]]*-1","v":0},"X","X","X","X","X","X","X","X","X","X","X","X"]
[null,null,null,null,"651G6018",0,"HDD 8TB SAS 7,2K 3,5“ 12GB/S 24/7","FOR GRAFENTHAL SERVER","MTTF 2.5M HOURS","X","X","X","X",{"$f":"Tabelle49[[#This Row],[Menge\n    *)]]*-1","v":0},{"$f":"Tabelle49[[#This Row],[Menge\n    *)]]*-1","v":0},{"$f":"Tabelle49[[#This Row],[Menge\n    *)]]*-1","v":0},{"$f":"Tabelle49[[#This Row],[Menge\n    *)]]*-1","v":0},{"$f":"Tabelle49[[#This Row],[Menge\n    *)]]*-1","v":0},"X","X",{"$f":"Tabelle49[[#This Row],[Menge\n    *)]]*-1","v":0},"X","X","X","X","X","X","X","X","X","X","X","X"]
[null,null,null,null,"651G6016",0,"HDD 10TB SAS 7,2K 3,5“ 12GB/S 24/7","FOR GRAFENTHAL SERVER","MTTF 2.5M HOURS","X","X","X","X",{"$f":"Tabelle49[[#This Row],[Menge\n    *)]]*-1","v":0},{"$f":"Tabelle49[[#This Row],[Menge\n    *)]]*-1","v":0},{"$f":"Tabelle49[[#This Row],[Menge\n    *)]]*-1","v":0},{"$f":"Tabelle49[[#This Row],[Menge\n    *)]]*-1","v":0},{"$f":"Tabelle49[[#This Row],[Menge\n    *)]]*-1","v":0},"X","X",{"$f":"Tabelle49[[#This Row],[Menge\n    *)]]*-1","v":0},"X","X","X","X","X","X","X","X","X","X","X","X"]
[null,null,null,null,"SAS 2,5\" 10k 12GB/s",{"$f":"SUM(F65:F70)","v":0}]
[null,null,null,null,"651G8020",0,"GRAFENTHAL HDD 300GB 10K 2.5'' SAS","12GB/S"," ","X","X","X","X",{"$f":"Tabelle49[[#This Row],[Menge\n    *)]]*-1","v":0},{"$f":"Tabelle49[[#This Row],[Menge\n    *)]]*-1","v":0},"X",{"$f":"Tabelle49[[#This Row],[Menge\n    *)]]*-1","v":0},{"$f":"Tabelle49[[#This Row],[Menge\n    *)]]*-1","v":0},"X","X",{"$f":"Tabelle49[[#This Row],[Menge\n    *)]]*-1","v":0},"X","X","X","X","X","X","X","X","X","X","X","X"]
[null,null,null,null,"651G8005",0,"GRAFENTHAL HDD 600GB 10K 2.5\\ SAS 12GB/S\""," "," ","X","X","X","X",{"$f":"Tabelle49[[#This Row],[Menge\n    *)]]*-1","v":0},{"$f":"Tabelle49[[#This Row],[Menge\n    *)]]*-1","v":0},"X",{"$f":"Tabelle49[[#This Row],[Menge\n    *)]]*-1","v":0},{"$f":"Tabelle49[[#This Row],[Menge\n    *)]]*-1","v":0},"X","X",{"$f":"Tabelle49[[#This Row],[Menge\n    *)]]*-1","v":0},"X","X","X","X","X","X","X","X","X","X","X","X"]
[null,null,null,null,"651G8006",0,"GRAFENTHAL HDD 900GB 10K 2.5\\ SAS 12GB/S\""," "," ","X","X","X","X",{"$f":"Tabelle49[[#This Row],[Menge\n    *)]]*-1","v":0},{"$f":"Tabelle49[[#This Row],[Menge\n    *)]]*-1","v":0},"X",{"$f":"Tabelle49[[#This Row],[Menge\n    *)]]*-1","v":0},{"$f":"Tabelle49[[#This Row],[Menge\n    *)]]*-1","v":0},"X","X",{"$f":"Tabelle49[[#This Row],[Menge\n    *)]]*-1","v":0},"X","X","X","X","X","X","X","X","X","X","X","X"]
[null,null,null,null,"651G8007",0,"GRAFENTHAL HDD 1.2TB 10K 2.5\\ SAS 12GB/S\""," "," ","X","X","X","X",{"$f":"Tabelle49[[#This Row],[Menge\n    *)]]*-1","v":0},{"$f":"Tabelle49[[#This Row],[Menge\n    *)]]*-1","v":0},"X",{"$f":"Tabelle49[[#This Row],[Menge\n    *)]]*-1","v":0},{"$f":"Tabelle49[[#This Row],[Menge\n    *)]]*-1","v":0},"X","X",{"$f":"Tabelle49[[#This Row],[Menge\n    *)]]*-1","v":0},"X","X","X","X","X","X","X","X","X","X","X","X"]
[null,null,null,null,"651G8021",0,"GRAFENTHAL HDD 1.8TB 10K 2.5'' SAS","12GB/S"," ","X","X","X","X",{"$f":"Tabelle49[[#This Row],[Menge\n    *)]]*-1","v":0},{"$f":"Tabelle49[[#This Row],[Menge\n    *)]]*-1","v":0},"X",{"$f":"Tabelle49[[#This Row],[Menge\n    *)]]*-1","v":0},{"$f":"Tabelle49[[#This Row],[Menge\n    *)]]*-1","v":0},"X","X",{"$f":"Tabelle49[[#This Row],[Menge\n    *)]]*-1","v":0},"X","X","X","X","X","X","X","X","X","X","X","X"]
[null,null,null,null,"651G8022",0,"GRAFENTHAL HDD 2.4TB 10K 2.5'' SAS","12GB/S"," ","X","X","X","X",{"$f":"Tabelle49[[#This Row],[Menge\n    *)]]*-1","v":0},{"$f":"Tabelle49[[#This Row],[Menge\n    *)]]*-1","v":0},"X",{"$f":"Tabelle49[[#This Row],[Menge\n    *)]]*-1","v":0},{"$f":"Tabelle49[[#This Row],[Menge\n    *)]]*-1","v":0},"X","X",{"$f":"Tabelle49[[#This Row],[Menge\n    *)]]*-1","v":0},"X","X","X","X","X","X","X","X","X","X","X","X"]
[null,null,null,null,"SAS 2,5\" 15k 12GB/s",{"$f":"SUM(F72:F74)","v":0}]
[null,null,null,null,"651G8003",0,"GRAFENTHAL HDD 300GB 15K 2.5\\ SAS 12GB/S\""," "," ","X","X","X","X",{"$f":"Tabelle49[[#This Row],[Menge\n    *)]]*-1","v":0},{"$f":"Tabelle49[[#This Row],[Menge\n    *)]]*-1","v":0},"X",{"$f":"Tabelle49[[#This Row],[Menge\n    *)]]*-1","v":0},{"$f":"Tabelle49[[#This Row],[Menge\n    *)]]*-1","v":0},"X","X",{"$f":"Tabelle49[[#This Row],[Menge\n    *)]]*-1","v":0},"X","X","X","X","X","X","X","X","X","X","X","X"]
[null,null,null,null,"651G8004",0,"GRAFENTHAL HDD 600GB 15K 2.5\\ SAS 12GB/S\""," "," ","X","X","X","X",{"$f":"Tabelle49[[#This Row],[Menge\n    *)]]*-1","v":0},{"$f":"Tabelle49[[#This Row],[Menge\n    *)]]*-1","v":0},"X",{"$f":"Tabelle49[[#This Row],[Menge\n    *)]]*-1","v":0},{"$f":"Tabelle49[[#This Row],[Menge\n    *)]]*-1","v":0},"X","X",{"$f":"Tabelle49[[#This Row],[Menge\n    *)]]*-1","v":0},"X","X","X","X","X","X","X","X","X","X","X","X"]
[null,null,null,null,"651G8019",0,"GRAFENTHAL HDD 900GB 15K 2.5'' SAS","12GB/S"," ","X","X","X","X",{"$f":"Tabelle49[[#This Row],[Menge\n    *)]]*-1","v":0},{"$f":"Tabelle49[[#This Row],[Menge\n    *)]]*-1","v":0},"X",{"$f":"Tabelle49[[#This Row],[Menge\n    *)]]*-1","v":0},{"$f":"Tabelle49[[#This Row],[Menge\n    *)]]*-1","v":0},"X","X",{"$f":"Tabelle49[[#This Row],[Menge\n    *)]]*-1","v":0},"X","X","X","X","X","X","X","X","X","X","X","X"]
[null,null,null,null,"SAS SSD  12GB/s *Midrange*",{"$f":"SUM(F76:F79)","v":0}]
[null,null,null,null,"651G7004",0,"GRAFENTHAL SSD 480GB 2,5'' SAS 12GB/S","MIDRANGE DWPD 1"," ","X","X","X","X",{"$f":"Tabelle49[[#This Row],[Menge\n    *)]]*-1","v":0},{"$f":"Tabelle49[[#This Row],[Menge\n    *)]]*-1","v":0},"X",{"$f":"Tabelle49[[#This Row],[Menge\n    *)]]*-1","v":0},"X","X","X",{"$f":"Tabelle49[[#This Row],[Menge\n    *)]]*-1","v":0},"X","X","X","X","X","X","X","X","X","X","X","X"]
[null,null,null,null,"651G7005",0,"GRAFENTHAL SSD 960GB 2,5'' SAS 12GB/S","MIDRANGE DWPD 1"," ","X","X","X","X",{"$f":"Tabelle49[[#This Row],[Menge\n    *)]]*-1","v":0},{"$f":"Tabelle49[[#This Row],[Menge\n    *)]]*-1","v":0},"X",{"$f":"Tabelle49[[#This Row],[Menge\n    *)]]*-1","v":0},"X","X","X",{"$f":"Tabelle49[[#This Row],[Menge\n    *)]]*-1","v":0},"X","X","X","X","X","X","X","X","X","X","X","X"]
[null,null,null,null,"651G7006",0,"GRAFENTHAL SSD 1920GB 2,5'' SAS 12GB/S","MIDRANGE DWPD 1"," ","X","X","X","X",{"$f":"Tabelle49[[#This Row],[Menge\n    *)]]*-1","v":0},{"$f":"Tabelle49[[#This Row],[Menge\n    *)]]*-1","v":0},"X",{"$f":"Tabelle49[[#This Row],[Menge\n    *)]]*-1","v":0},"X","X","X",{"$f":"Tabelle49[[#This Row],[Menge\n    *)]]*-1","v":0},"X","X","X","X","X","X","X","X","X","X","X","X"]
[null,null,null,null,"651G7007",0,"GRAFENTHAL SSD 3840GB 2,5'' SAS 12GB/S","MIDRANGE DWPD 1"," ","X","X","X","X",{"$f":"Tabelle49[[#This Row],[Menge\n    *)]]*-1","v":0},{"$f":"Tabelle49[[#This Row],[Menge\n    *)]]*-1","v":0},"X",{"$f":"Tabelle49[[#This Row],[Menge\n    *)]]*-1","v":0},"X","X","X",{"$f":"Tabelle49[[#This Row],[Menge\n    *)]]*-1","v":0},"X","X","X","X","X","X","X","X","X","X","X","X"]
[null,null,null,null,"SSD PCIe NVMe",{"$f":"SUM(F81:F83)","v":0}]
[null,null,null,null,"651G6030",0,"GRAFENTHAL SSD 800GB NVME ENTERPRISE","READ 3100MB/S WRITE 2350MB/S 32GT/S","PCI EXPRESS 3.0","X","X","X","X","X","X","X","X","X","X","X","X","X","X","X",{"$f":"Tabelle49[[#This Row],[Menge\n    *)]]*-1","v":0},{"$f":"Tabelle49[[#This Row],[Menge\n    *)]]*-1","v":0},"X","X","X","X","X","X","X"]
[null,null,null,null,"651G6031",0,"GRAFENTHAL SSD 1600GB NVME ENTERPRISE","READ 3100MB/S WRITE 2350MB/S 32GT/S","PCI EXPRESS 3.0","X","X","X","X","X","X","X","X","X","X","X","X","X","X","X",{"$f":"Tabelle49[[#This Row],[Menge\n    *)]]*-1","v":0},{"$f":"Tabelle49[[#This Row],[Menge\n    *)]]*-1","v":0},"X","X","X","X","X","X","X"]
[null,null,null,null,"651G6032",0,"GRAFENTHAL SSD 3200GB NVME ENTERPRISE","READ 3100MB/S WRITE 2350MB/S 32GT/S","PCI EXPRESS 3.0","X","X","X","X","X","X","X","X","X","X","X","X","X","X","X",{"$f":"Tabelle49[[#This Row],[Menge\n    *)]]*-1","v":0},{"$f":"Tabelle49[[#This Row],[Menge\n    *)]]*-1","v":0},"X","X","X","X","X","X","X"]
[null,null,null,null,"SSD M.2 NVMe",{"$f":"SUM(F85:F87)","v":0}]
[null,null,null,null,"651G7000",0,"GRAFENTHAL SSD 512GB NVME M.2","PCIe 3.0 x4 READ 3500MB/S WRITE 2100MB/S"," ",null,null,null,null,null,null,null,null,{"$f":"Tabelle49[[#This Row],[Menge\n    *)]]*-1","v":0},null,null,null,null,null,null,null,null,null,null,null,null,null,null,{"$f":"Tabelle49[[#This Row],[Menge\n    *)]]*-1","v":0}]
[null,null,null,null,"651G7001",0,"GRAFENTHAL SSD 1TB NVME M.2","PCIe 3.0 x4 READ 3500MB/S WRITE 2100MB/S"," ",null,null,null,null,null,null,null,null,{"$f":"Tabelle49[[#This Row],[Menge\n    *)]]*-1","v":0},null,null,null,null,null,null,null,null,null,null,null,null,null,null,{"$f":"Tabelle49[[#This Row],[Menge\n    *)]]*-1","v":0}]
[null,null,null,null,"651G7002",0,"GRAFENTHAL SSD 2TB NVME M.2","PCIe 3.0 x4 READ 3500MB/S WRITE 2100MB/S"," ",null,null,null,null,null,null,null,null,{"$f":"Tabelle49[[#This Row],[Menge\n    *)]]*-1","v":0},null,null,null,null,null,null,null,null,null,null,null,null,null,null,{"$f":"Tabelle49[[#This Row],[Menge\n    *)]]*-1","v":0}]
[null,null,null,"+","SSD M.2 SATA",{"$f":"SUM(F89:F92)","v":0}]
[null,null,null,"+","651G8000",0,"GRAFENTHAL SSD 256GB M.2 2280 SATA 6GB/S","256BIT-AES MTBF 1.6M HOURS TBW 144TB"," ",null,null,null,null,null,null,null,null,{"$f":"Tabelle49[[#This Row],[Menge\n    *)]]*-1","v":0},null,null,null,null,null,null,null,null,null,null,null,null,null,null,{"$f":"Tabelle49[[#This Row],[Menge\n    *)]]*-1","v":0}]
[null,null,null,"+","651G8001",0,"GRAFENTHAL SSD 512GB M.2 2280 SATA 6GB/S","256BIT-AES MTBF 1.6M HOURS TBW 288TB"," ",null,null,null,null,null,null,null,null,{"$f":"Tabelle49[[#This Row],[Menge\n    *)]]*-1","v":0},null,null,null,null,null,null,null,null,null,null,null,null,null,null,{"$f":"Tabelle49[[#This Row],[Menge\n    *)]]*-1","v":0}]
[null,null,null,"+","651G8002",0,"GRAFENTHAL SSD 1TB M.2 2280 SATA 6GB/S","256BIT-AES TCG OPAL 2.0 MTBF 1.5M HOURS"," ",null,null,null,null,null,null,null,null,{"$f":"Tabelle49[[#This Row],[Menge\n    *)]]*-1","v":0},null,null,null,null,null,null,null,null,null,null,null,null,null,null,{"$f":"Tabelle49[[#This Row],[Menge\n    *)]]*-1","v":0}]
[null,null,null,null,"DVD",{"$f":"SUM(F93)","v":0}]
[null,null,null,null,"658G6005",0,"GRAFENTHAL MULTIBURNER DVD DRIVE 5,25''","FOR T2910 S2 / W2910 S2"," ","X","X","X","X","X","X","X","X",{"$f":"Tabelle49[[#This Row],[Menge\n    *)]]*-1","v":0},"X","X","X","X","X",{"$f":"Tabelle49[[#This Row],[Menge\n    *)]]*-1","v":0},"X","X","X","X",{"$f":"Tabelle49[[#This Row],[Menge\n    *)]]*-1","v":0},"X","X","X","X"]
[null,null,null,null,"Raid Controller",{"$f":"SUM(F95:F98)","v":0}]
[null,null,null,null,"658G7000",{"$f":"SUM(F96:F97)*2","v":0},"GRAFENTHAL CABLE INTERNAL 4x MINI SAS HD","TO 4x MINI SAS HD SFF-8643 0.8M"," ","X","X","X","X","X","X","X","X","X","X","X","X","X","X","X","X","X","X","X","X","X","X","X","X"]
[null,null,null,null,"653G5007",0,"GRAFENTHAL RAID CONTROLLER SAS/SATA","12GB/S /6GB/S 8i 1GB CACHE","RAID 0 1  5 6 10 50 60 TYP 9361-8I",null,null,null,null,null,null,null,{"$f":"Tabelle49[[#This Row],[Menge\n    *)]]*8","v":0},null,null,null,{"$f":"Tabelle49[[#This Row],[Menge\n    *)]]*8","v":0},{"$f":"Tabelle49[[#This Row],[Menge\n    *)]]*1","v":0},null,null,{"$f":"Tabelle49[[#This Row],[Menge\n    *)]]*-1","v":0},{"$f":"Tabelle49[[#This Row],[Menge\n    *)]]*-1","v":0},{"$f":"Tabelle49[[#This Row],[Menge\n    *)]]*-1","v":0},null,null,null,{"$f":"Tabelle49[[#This Row],[Menge\n    *)]]*1","v":0}]
[null,null,null,null,"653G5008",0,"GRAFENTHAL RAID CONTROLLER SAS/SATA","12GB/S /6GB/S 8i NO CACHE"," ",null,null,null,null,null,null,null,{"$f":"Tabelle49[[#This Row],[Menge\n    *)]]*8","v":0},null,null,null,{"$f":"Tabelle49[[#This Row],[Menge\n    *)]]*8","v":0},null,null,null,{"$f":"Tabelle49[[#This Row],[Menge\n    *)]]*-1","v":0},{"$f":"Tabelle49[[#This Row],[Menge\n    *)]]*-1","v":0},{"$f":"Tabelle49[[#This Row],[Menge\n    *)]]*-1","v":0},null,null,null,{"$f":"Tabelle49[[#This Row],[Menge\n    *)]]*1","v":0}]
[null,null,null,null,"653G5903",0,"GRAFENTHAL CACHEVAULT FLASH CACHE","PROTECTION MODULE FOR RAID CTR"," ","X","X","X","X","X","X","X","X","X","X","X","X",null,"X","X","X","X","X","X","X","X","X","X","X"]
[null,null,null,null,"HBA SAS",{"$f":"SUM(F100:F101)","v":0}]
[null,null,null,null,"653G6004",0,"GRAFENTHAL HBA SAS/SATA 12Gb/s 9305-16i"," "," ","X","X","X","X","X","X","X",{"$f":"Tabelle49[[#This Row],[Menge\n    *)]]*16","v":0},"X","X","X",{"$f":"Tabelle49[[#This Row],[Menge\n    *)]]*16","v":0},"X","X","X","X","X","X","X","X","X",{"$f":"Tabelle49[[#This Row],[Menge\n    *)]]*1","v":0},"X","X"]
[null,null,null,null,"653G6005",0,"GRAFENTHAL HBA SAS/SATA 12Gb/s 9300-4i4e"," "," ","X","X","X","X","X","X","X","X","X","X","X","X","X","X","X",{"$f":"Tabelle49[[#This Row],[Menge\n    *)]]*-1","v":0},{"$f":"Tabelle49[[#This Row],[Menge\n    *)]]*-1","v":0},{"$f":"Tabelle49[[#This Row],[Menge\n    *)]]*-1","v":0},"X","X","X","X","X","X"]
[null,null,null,null,"653G7005",0,"GRAFENTHAL CONTROLLER HBA SAS 9300-8E","8 PORT EXTERN MULTI LANE PCI LP BROADCOM"," ","X","X","X","X","X","X","X","X","X","X","X","X","X","X","X",{"$f":"Tabelle49[[#This Row],[Menge\n    *)]]*-1","v":0},{"$f":"Tabelle49[[#This Row],[Menge\n    *)]]*-1","v":0},{"$f":"Tabelle49[[#This Row],[Menge\n    *)]]*-1","v":0},"X","X","X","X","X","X"]
[null,null,null,null,"653G7006",0,"GRAFENTHAL EXTERNAL SAS CABLE 2M","SFF-8644 TO SFF-8644"," ","X","X","X","X","X","X","X","X","X","X","X","X","X","X","X","X","X","X","X","X","X","X","X","X"]
[null,null,null,null,"653G7007",0,"GRAFENTHAL EXTERNAL SAS CABLE 1M","SFF-8644 TO SFF-8644"," ","X","X","X","X","X","X","X","X","X","X","X","X","X","X","X","X","X","X","X","X","X","X","X","X"]
[null,null,null,null,"(Kupfer-) Netzkarte",{"$f":"SUM(F106:F107)","v":0}]
[null,null,null,null,"653G7002",0,"GRAFENTHAL ETHERNET ADAPTER DUAL PORT","RJ45 2x10GBE X550-T2 PCIe 3.0 x4"," ","X","X","X","X","X","X","X","X","X","X","X","X","X","X","X",{"$f":"Tabelle49[[#This Row],[Menge\n    *)]]*-1","v":0},{"$f":"Tabelle49[[#This Row],[Menge\n    *)]]*-1","v":0},{"$f":"Tabelle49[[#This Row],[Menge\n    *)]]*-1","v":0},"X","X","X","X","X","X"]
[null,null,null,null,"659G8015",0,"GRAFENTHAL GIGABIT ETHERNET APDATER","I350-T4V2 4x RJ-45 PCIe x4 COPPER"," ","X","X","X","X","X","X","X","X","X","X","X","X","X","X","X",{"$f":"Tabelle49[[#This Row],[Menge\n    *)]]*-1","v":0},{"$f":"Tabelle49[[#This Row],[Menge\n    *)]]*-1","v":0},"X","X","X","X","X","X","X"]
[null,null,null,null,"(SFP+)Netzwerkkarte",{"$f":"SUM(#REF!)","v":{"$error":"#REF!"}}]
[null,null,null,null,"653G7003",0,"GRAFENTHAL ETHERNET ADAPTER 2-PORT 10GBE","INTEL X520 FIBRE SFP+ PCIe x8 LP"," ",null,null,null,null,null,null,null,null,null,null,null,null,null,null,null,{"$f":"Tabelle49[[#This Row],[Menge\n    *)]]*-1","v":0},{"$f":"Tabelle49[[#This Row],[Menge\n    *)]]*-1","v":0},{"$f":"Tabelle49[[#This Row],[Menge\n    *)]]*-1","v":0}]
[null,null,null,null,"653G7000",0,"GRAFENTHAL ETHERNET ADAPTER DUAL PORT","QSFP+ 2x10GBE/40GBE PCIe 3.0 x8 XL710-QD"," ",null,null,null,null,null,null,null,null,null,null,null,null,null,null,null,{"$f":"Tabelle49[[#This Row],[Menge\n    *)]]*-1","v":0},{"$f":"Tabelle49[[#This Row],[Menge\n    *)]]*-1","v":0},{"$f":"Tabelle49[[#This Row],[Menge\n    *)]]*-1","v":0}]
[null,null,null,null,"Glasfaserkarten",{"$f":"SUM(F112:F113)","v":0}]
[null,null,null,null,"659G7000",0,"GRAFENTHAL QLOGIC HBA FC SINGLE PORT","16GB/S PCIe 3.0 x8"," ","X","X","X","X","X","X","X","X","X","X","X","X","X","X","X",{"$f":"Tabelle49[[#This Row],[Menge\n    *)]]*-1","v":0},{"$f":"Tabelle49[[#This Row],[Menge\n    *)]]*-1","v":0},{"$f":"Tabelle49[[#This Row],[Menge\n    *)]]*-1","v":0},"X","X","X","X","X","X"]
[null,null,null,null,"659G7001",0,"GRAFENTHAL QLOGIC HBA FC DUAL PORT","16GB/S PCIe 3.0 x8"," ","X","X","X","X","X","X","X","X","X","X","X","X","X","X","X",{"$f":"Tabelle49[[#This Row],[Menge\n    *)]]*-1","v":0},{"$f":"Tabelle49[[#This Row],[Menge\n    *)]]*-1","v":0},{"$f":"Tabelle49[[#This Row],[Menge\n    *)]]*-1","v":0},"X","X","X","X","X","X"]
[null,null,null,null,"Grafikkarte",{"$f":"SUM(F115:F127)","v":0}]
[null,null,null,null,"159G6001",0,"GRAFENTHAL INTERNAL POWER CABLE VGA/GPU","FOR T2910 S2 / W2910 S2"," ","X","X","X","X","X","X","X","X","X","X","X","X","X","X","X",{"$f":"Tabelle49[[#This Row],[Menge\n    *)]]*-1","v":0},{"$f":"Tabelle49[[#This Row],[Menge\n    *)]]*-1","v":0},{"$f":"Tabelle49[[#This Row],[Menge\n    *)]]*-1","v":0},{"$f":"Tabelle49[[#This Row],[Menge\n    *)]]*-1","v":0},"X","X","X","X","X"]
[null,null,null,null,"659G6021",0,"GRAFENTHAL GRAPHIC CARD QUADRO K600","1GB GDDR3 29.0GB/S PCIe 2.0 x16 41W"," ","X","X","X","X","X","X","X","X","X","X","X","X","X","X","X",{"$f":"Tabelle49[[#This Row],[Menge\n    *)]]*-1","v":0},{"$f":"Tabelle49[[#This Row],[Menge\n    *)]]*-1","v":0},{"$f":"Tabelle49[[#This Row],[Menge\n    *)]]*-1","v":0},{"$f":"Tabelle49[[#This Row],[Menge\n    *)]]*-1","v":0},"X","X","X","X","X"]
[null,null,null,null,"659G6022",0,"GRAFENTHAL GRAPHIC CARD QUADRO K2000","2GB GDDR5 64.0GB/S PCIe 2.0 x16 51W"," ","X","X","X","X","X","X","X","X","X","X","X","X","X","X","X",{"$f":"Tabelle49[[#This Row],[Menge\n    *)]]*-1","v":0},{"$f":"Tabelle49[[#This Row],[Menge\n    *)]]*-1","v":0},{"$f":"Tabelle49[[#This Row],[Menge\n    *)]]*-1","v":0},{"$f":"Tabelle49[[#This Row],[Menge\n    *)]]*-1","v":0},"X","X","X","X","X"]
[null,null,null,null,"659G6023",0,"GRAFENTHAL GRAPHIC CARD QUADRO K4000","3GB GDDR5 134.0GB/S PCIe 2.0 x16 80W"," ","X","X","X","X","X","X","X","X","X","X","X","X","X","X","X",{"$f":"Tabelle49[[#This Row],[Menge\n    *)]]*-1","v":0},{"$f":"Tabelle49[[#This Row],[Menge\n    *)]]*-1","v":0},{"$f":"Tabelle49[[#This Row],[Menge\n    *)]]*-1","v":0},{"$f":"Tabelle49[[#This Row],[Menge\n    *)]]*-1","v":0},"X","X","X","X","X"]
[null,null,null,null,"659G6024",0,"GRAFENTHAL GRAPHIC CARD QUADRO K5000","4GB GDDR5 173.0GB/S PCIe 2.0 x16 122W"," ","X","X","X","X","X","X","X","X","X","X","X","X","X","X","X",{"$f":"Tabelle49[[#This Row],[Menge\n    *)]]*-1","v":0},{"$f":"Tabelle49[[#This Row],[Menge\n    *)]]*-1","v":0},{"$f":"Tabelle49[[#This Row],[Menge\n    *)]]*-1","v":0},{"$f":"Tabelle49[[#This Row],[Menge\n    *)]]*-1","v":0},"X","X","X","X","X"]
[null,null,null,null,"659G6025",0,"GRAFENTHAL GPU CARD TESLA K10 2x4GB","GDDR5 PCIe 3.0 x16 PASSIVE HEATSINK 225W"," ","X","X","X","X","X","X","X","X","X","X","X","X","X","X","X",{"$f":"Tabelle49[[#This Row],[Menge\n    *)]]*-1","v":0},{"$f":"Tabelle49[[#This Row],[Menge\n    *)]]*-1","v":0},{"$f":"Tabelle49[[#This Row],[Menge\n    *)]]*-1","v":0},{"$f":"Tabelle49[[#This Row],[Menge\n    *)]]*-1","v":0},"X","X","X","X","X"]
[null,null,null,null,"659G6026",0,"GRAFENTHAL GPU CARD TESLA K20C 5GB GDDR5","PCIe 2.0 x16 ACTIVE HEATSINK 225W","208.0GB/S FOR T2910 S2 / W2910 S2","X","X","X","X","X","X","X","X","X","X","X","X","X","X","X",{"$f":"Tabelle49[[#This Row],[Menge\n    *)]]*-1","v":0},{"$f":"Tabelle49[[#This Row],[Menge\n    *)]]*-1","v":0},{"$f":"Tabelle49[[#This Row],[Menge\n    *)]]*-1","v":0},{"$f":"Tabelle49[[#This Row],[Menge\n    *)]]*-1","v":0},"X","X","X","X","X"]
[null,null,null,null,"659G6027",0,"GRAFENTHAL GPU CARD TESLA K20M 5GB GDDR5","PCIe 2.0 x16 PASSIVE HEATSINK 225W","208.0GB/S FOR T2910 S2 / W2910 S2","X","X","X","X","X","X","X","X","X","X","X","X","X","X","X",{"$f":"Tabelle49[[#This Row],[Menge\n    *)]]*-1","v":0},{"$f":"Tabelle49[[#This Row],[Menge\n    *)]]*-1","v":0},{"$f":"Tabelle49[[#This Row],[Menge\n    *)]]*-1","v":0},{"$f":"Tabelle49[[#This Row],[Menge\n    *)]]*-1","v":0},"X","X","X","X","X"]
[null,null,null,null,"659G6028",0,"GRAFENTHAL GPU CARD TESLA K20X 6GB GDDR5","PCIe 3.0 x16 PASSIVE HEATSINK 235W","249.6GB/S FOR T2910 S2 / W2910 S2","X","X","X","X","X","X","X","X","X","X","X","X","X","X","X",{"$f":"Tabelle49[[#This Row],[Menge\n    *)]]*-1","v":0},{"$f":"Tabelle49[[#This Row],[Menge\n    *)]]*-1","v":0},{"$f":"Tabelle49[[#This Row],[Menge\n    *)]]*-1","v":0},{"$f":"Tabelle49[[#This Row],[Menge\n    *)]]*-1","v":0},"X","X","X","X","X"]
[null,null,null,null,"659G6029",0,"GRAFENTHAL GPU CARD TESLA K40M 12GB","GDDR5 PCIe 3.0 x16 PASSIVE HEATSINK 245W","288.4GB/S FOR T2910 S2 / W2910 S2","X","X","X","X","X","X","X","X","X","X","X","X","X","X","X",{"$f":"Tabelle49[[#This Row],[Menge\n    *)]]*-1","v":0},{"$f":"Tabelle49[[#This Row],[Menge\n    *)]]*-1","v":0},{"$f":"Tabelle49[[#This Row],[Menge\n    *)]]*-1","v":0},{"$f":"Tabelle49[[#This Row],[Menge\n    *)]]*-1","v":0},"X","X","X","X","X"]
[null,null,null,null,"659G6030",0,"GRAFENTHAL GPU CARD TESLA K40C 12GB","GDDR5 PCIe 3.0 x16 ACTIVE HEATSINK 245W","288.4GB/S FOR T2910 S2 / W2910 S2","X","X","X","X","X","X","X","X","X","X","X","X","X","X","X",{"$f":"Tabelle49[[#This Row],[Menge\n    *)]]*-1","v":0},{"$f":"Tabelle49[[#This Row],[Menge\n    *)]]*-1","v":0},{"$f":"Tabelle49[[#This Row],[Menge\n    *)]]*-1","v":0},{"$f":"Tabelle49[[#This Row],[Menge\n    *)]]*-1","v":0},"X","X","X","X","X"]
[null,null,null,null,"659G6031",0,"GRAFENTHAL GPU CARD TESLA K2 2x4GB","GDDR5 PCIe 3.0 x16 PASSIVE HEATSINK 225W","160.0GB/S FOR T2910 S2 / W2910 S2","X","X","X","X","X","X","X","X","X","X","X","X","X","X","X",{"$f":"Tabelle49[[#This Row],[Menge\n    *)]]*-1","v":0},{"$f":"Tabelle49[[#This Row],[Menge\n    *)]]*-1","v":0},{"$f":"Tabelle49[[#This Row],[Menge\n    *)]]*-1","v":0},{"$f":"Tabelle49[[#This Row],[Menge\n    *)]]*-1","v":0},"X","X","X","X","X"]
[null,null,null,null,"659G6032",0,"GRAFENTHAL GPU CARD TESLA K1 4x4GB","GDDR5 PCIe 3.0 x16 PASSIVE HEATSINK 130W","28.51GB/S x4 FOR T2910 S2 / W2910 S2","X","X","X","X","X","X","X","X","X","X","X","X","X","X","X",{"$f":"Tabelle49[[#This Row],[Menge\n    *)]]*-1","v":0},{"$f":"Tabelle49[[#This Row],[Menge\n    *)]]*-1","v":0},{"$f":"Tabelle49[[#This Row],[Menge\n    *)]]*-1","v":0},{"$f":"Tabelle49[[#This Row],[Menge\n    *)]]*-1","v":0},"X","X","X","X","X"]
[null,null,null,null,"PSU",{"$f":"SUM(F129:F130)","v":0}]
[null,null,null,null,"654G6003",0,"GRAFENTHAL REDUNDANT PSU UPGRADE MODULE","800W FOR T2910 S2 AND W2910 S2"," ",null,null,null,null,null,null,null,null,null,null,null,null,null,null,null,null,null,null,null,null,null,null,null,"X"]
[null,null,null,null,"654G6003",{"$f":"IF(SUM(F17:F27)>1,1,0)","v":0},"GRAFENTHAL REDUNDANT PSU UPGRADE MODULE","800W FOR T2910 S2 AND W2910 S2"," ","X","X","X","X","X","X","X","X","X","X","X","X","X","X","X","X","X","X","X","X",{"$f":"Tabelle49[[#This Row],[Menge\n    *)]]*-1","v":0},"X","X","X"]
[null,null,null,null,"Tower to Rack",{"$f":"SUM(F132)","v":0}]
[null,null,null,null,"659G6020",0,"GRAFENTHAL TOWER TO RACK KIT","FOR T2910 S2 AND W2910 S2"," ",null,null,null,null,null,null,null,null,null,null,null,null,null,null,null,null,null,null,null,null,null,null,null,"X"]
[null,null,null,null,"Betriebssysteme",{"$f":"SUM(F134:F135)","v":0}]
[null,null,null,null,"655G3002",0,"GRAFENTHAL WINDOWS SERVER 2012 R2","ESSENTIALS LIZENZ UND MEDIEN 1-2 CPU"," ","X","X","X","X","X","X","X","X","X","X","X","X","X","X","X","X","X","X","X","X","X","X","X","X"]
[null,null,null,null,"655G3003",0,"GRAFENTHAL WINDOWS SERVER 2012 R2","STANDARD LIZENZ UND MEDIEN 2 CPU"," ","X","X","X","X","X","X","X","X","X","X","X","X","X","X","X","X","X","X","X","X","X","X","X","X"]
[null,null,null,null,"P73-07115",0,"MICROSOFT WINDOWS SERVER 2016 STANDARD","64BIT 16C"," "]
[null,null,null,null,"MPAC",{"$f":"SUM(F138:F173)","v":0}]
[null,null,null,null,"740M6157",0,"GRAFENTHAL MPAC VOR ORT SERVICE UPGRADE","3 JAHRE 13x5 24STD WIEDERHERSTELLUNG","FÜR T2910 S2 BIS E5-264X","X","X","X","X","X","X","X","X","X","X","X","X","X","X","X","X","X","X","X","X","X","X","X","X"]
[null,null,null,null,"740M6158",0,"GRAFENTHAL MPAC VOR ORT SERVICE UPGRADE","3 JAHRE 13x5 12STD WIEDERHERSTELLUNG","FÜR T2910 S2 BIS E5-264X","X","X","X","X","X","X","X","X","X","X","X","X","X","X","X","X","X","X","X","X","X","X","X","X"]
[null,null,null,null,"740M6159",0,"GRAFENTHAL MPAC VOR ORT SERVICE UPGRADE","3 JAHRE 24x7 6STD WIEDERHERSTELLUNG","FÜR T2910 S2 BIS E5-264X","X","X","X","X","X","X","X","X","X","X","X","X","X","X","X","X","X","X","X","X","X","X","X","X"]
[null,null,null,null,"740M6160",0,"GRAFENTHAL MPAC VOR ORT SERVICE UPGRADE","4 JAHRE 13x5 24STD WIEDERHERSTELLUNG","FÜR T2910 S2 BIS E5-264X","X","X","X","X","X","X","X","X","X","X","X","X","X","X","X","X","X","X","X","X","X","X","X","X"]
[null,null,null,null,"740M6161",0,"GRAFENTHAL MPAC VOR ORT SERVICE UPGRADE","4 JAHRE 13x5 12STD WIEDERHERSTELLUNG","FÜR T2910 S2 BIS E5-264X","X","X","X","X","X","X","X","X","X","X","X","X","X","X","X","X","X","X","X","X","X","X","X","X"]
[null,null,null,null,"740M6162",0,"GRAFENTHAL MPAC VOR ORT SERVICE UPGRADE","4 JAHRE 24x7 6STD WIEDERHERSTELLUNG","FÜR T2910 S2 BIS E5-264X","X","X","X","X","X","X","X","X","X","X","X","X","X","X","X","X","X","X","X","X","X","X","X","X"]
[null,null,null,null,"740M6163",0,"GRAFENTHAL MPAC VOR ORT SERVICE UPGRADE","5 JAHRE 13x5 24STD WIEDERHERSTELLUNG","FÜR T2910 S2 BIS E5-264X","X","X","X","X","X","X","X","X","X","X","X","X","X","X","X","X","X","X","X","X","X","X","X","X"]
[null,null,null,null,"740M6164",0,"GRAFENTHAL MPAC VOR ORT SERVICE UPGRADE","5 JAHRE 13x5 12STD WIEDERHERSTELLUNG","FÜR T2910 S2 BIS E5-264X","X","X","X","X","X","X","X","X","X","X","X","X","X","X","X","X","X","X","X","X","X","X","X","X"]
[null,null,null,null,"740M6165",0,"GRAFENTHAL MPAC VOR ORT SERVICE UPGRADE","5 JAHRE 24x7 6STD WIEDERHERSTELLUNG","FÜR T2910 S2 BIS E5-264X","X","X","X","X","X","X","X","X","X","X","X","X","X","X","X","X","X","X","X","X","X","X","X","X"]
[null,null,null,null,"740M6166",0,"GRAFENTHAL MPAC VOR ORT SERVICE UPGRADE","3 JAHRE 13x5 24STD WIEDERHERSTELLUNG","FÜR T2910 S2 AB E5-2650","X","X","X","X","X","X","X","X","X","X","X","X","X","X","X","X","X","X","X","X","X","X","X","X"]
[null,null,null,null,"740M6167",0,"GRAFENTHAL MPAC VOR ORT SERVICE UPGRADE","3 JAHRE 13x5 12STD WIEDERHERSTELLUNG","FÜR T2910 S2 AB E5-2650","X","X","X","X","X","X","X","X","X","X","X","X","X","X","X","X","X","X","X","X","X","X","X","X"]
[null,null,null,null,"740M6168",0,"GRAFENTHAL MPAC VOR ORT SERVICE UPGRADE","3 JAHRE 24x7 6STD WIEDERHERSTELLUNG","FÜR T2910 S2 AB E5-2650","X","X","X","X","X","X","X","X","X","X","X","X","X","X","X","X","X","X","X","X","X","X","X","X"]
[null,null,null,null,"740M6169",0,"GRAFENTHAL MPAC VOR ORT SERVICE UPGRADE","4 JAHRE 13x5 24STD WIEDERHERSTELLUNG","FÜR T2910 S2 AB E5-2650","X","X","X","X","X","X","X","X","X","X","X","X","X","X","X","X","X","X","X","X","X","X","X","X"]
[null,null,null,null,"740M6170",0,"GRAFENTHAL MPAC VOR ORT SERVICE UPGRADE","4 JAHRE 13x5 12STD WIEDERHERSTELLUNG","FÜR T2910 S2 AB E5-2650","X","X","X","X","X","X","X","X","X","X","X","X","X","X","X","X","X","X","X","X","X","X","X","X"]
[null,null,null,null,"740M6171",0,"GRAFENTHAL MPAC VOR ORT SERVICE UPGRADE","4 JAHRE 24x7 6STD WIEDERHERSTELLUNG","FÜR T2910 S2 AB E5-2650","X","X","X","X","X","X","X","X","X","X","X","X","X","X","X","X","X","X","X","X","X","X","X","X"]
[null,null,null,null,"740M6172",0,"GRAFENTHAL MPAC VOR ORT SERVICE UPGRADE","5 JAHRE 13x5 24STD WIEDERHERSTELLUNG","FÜR T2910 S2 AB E5-2650","X","X","X","X","X","X","X","X","X","X","X","X","X","X","X","X","X","X","X","X","X","X","X","X"]
[null,null,null,null,"740M6173",0,"GRAFENTHAL MPAC VOR ORT SERVICE UPGRADE","5 JAHRE 13x5 12STD WIEDERHERSTELLUNG","FÜR T2910 S2 AB E5-2650","X","X","X","X","X","X","X","X","X","X","X","X","X","X","X","X","X","X","X","X","X","X","X","X"]
[null,null,null,null,"740M6174",0,"GRAFENTHAL MPAC VOR ORT SERVICE UPGRADE","5 JAHRE 24x7 6STD WIEDERHERSTELLUNG","FÜR T2910 S2 AB E5-2650","X","X","X","X","X","X","X","X","X","X","X","X","X","X","X","X","X","X","X","X","X","X","X","X"]
[null,null,null,null,"740M6175",0,"GRAFENTHAL MPAC VOR ORT SERVICE UPGRADE","3 JAHRE 13x5 24STD WIEDERHERSTELLUNG DMR","FÜR T2910 S2 BIS E5-264X","X","X","X","X","X","X","X","X","X","X","X","X","X","X","X","X","X","X","X","X","X","X","X","X"]
[null,null,null,null,"740M6176",0,"GRAFENTHAL MPAC VOR ORT SERVICE UPGRADE","3 JAHRE 13x5 12STD WIEDERHERSTELLUNG DMR","FÜR T2910 S2 BIS E5-264X","X","X","X","X","X","X","X","X","X","X","X","X","X","X","X","X","X","X","X","X","X","X","X","X"]
[null,null,null,null,"740M6177",0,"GRAFENTHAL MPAC VOR ORT SERVICE UPGRADE","3 JAHRE 24x7 6STD WIEDERHERSTELLUNG DMR","FÜR T2910 S2 BIS E5-264X","X","X","X","X","X","X","X","X","X","X","X","X","X","X","X","X","X","X","X","X","X","X","X","X"]
[null,null,null,null,"740M6178",0,"GRAFENTHAL MPAC VOR ORT SERVICE UPGRADE","4 JAHRE 13x5 24STD WIEDERHERSTELLUNG DMR","FÜR T2910 S2 BIS E5-264X","X","X","X","X","X","X","X","X","X","X","X","X","X","X","X","X","X","X","X","X","X","X","X","X"]
[null,null,null,null,"740M6179",0,"GRAFENTHAL MPAC VOR ORT SERVICE UPGRADE","4 JAHRE 13x5 12STD WIEDERHERSTELLUNG DMR","FÜR T2910 S2 BIS E5-264X","X","X","X","X","X","X","X","X","X","X","X","X","X","X","X","X","X","X","X","X","X","X","X","X"]
[null,null,null,null,"740M6180",0,"GRAFENTHAL MPAC VOR ORT SERVICE UPGRADE","4 JAHRE 24x7 6STD WIEDERHERSTELLUNG DMR","FÜR T2910 S2 BIS E5-264X","X","X","X","X","X","X","X","X","X","X","X","X","X","X","X","X","X","X","X","X","X","X","X","X"]
[null,null,null,null,"740M6181",0,"GRAFENTHAL MPAC VOR ORT SERVICE UPGRADE","5 JAHRE 13x5 24STD WIEDERHERSTELLUNG DMR","FÜR T2910 S2 BIS E5-264X","X","X","X","X","X","X","X","X","X","X","X","X","X","X","X","X","X","X","X","X","X","X","X","X"]
[null,null,null,null,"740M6182",0,"GRAFENTHAL MPAC VOR ORT SERVICE UPGRADE","5 JAHRE 13x5 12STD WIEDERHERSTELLUNG DMR","FÜR T2910 S2 BIS E5-264X","X","X","X","X","X","X","X","X","X","X","X","X","X","X","X","X","X","X","X","X","X","X","X","X"]
[null,null,null,null,"740M6183",0,"GRAFENTHAL MPAC VOR ORT SERVICE UPGRADE","5 JAHRE 24x7 6STD WIEDERHERSTELLUNG DMR","FÜR T2910 S2 BIS E5-264X","X","X","X","X","X","X","X","X","X","X","X","X","X","X","X","X","X","X","X","X","X","X","X","X"]
[null,null,null,null,"740M6184",0,"GRAFENTHAL MPAC VOR ORT SERVICE UPGRADE","3 JAHRE 13x5 24STD WIEDERHERSTELLUNG DMR","FÜR T2910 S2 AB E5-2650","X","X","X","X","X","X","X","X","X","X","X","X","X","X","X","X","X","X","X","X","X","X","X","X"]
[null,null,null,null,"740M6185",0,"GRAFENTHAL MPAC VOR ORT SERVICE UPGRADE","3 JAHRE 13x5 12STD WIEDERHERSTELLUNG DMR","FÜR T2910 S2 AB E5-2650","X","X","X","X","X","X","X","X","X","X","X","X","X","X","X","X","X","X","X","X","X","X","X","X"]
[null,null,null,null,"740M6186",0,"GRAFENTHAL MPAC VOR ORT SERVICE UPGRADE","3 JAHRE 24x7 6STD WIEDERHERSTELLUNG DMR","FÜR T2910 S2 AB E5-2650","X","X","X","X","X","X","X","X","X","X","X","X","X","X","X","X","X","X","X","X","X","X","X","X"]
[null,null,null,null,"740M6187",0,"GRAFENTHAL MPAC VOR ORT SERVICE UPGRADE","4 JAHRE 13x5 24STD WIEDERHERSTELLUNG DMR","FÜR T2910 S2 AB E5-2650","X","X","X","X","X","X","X","X","X","X","X","X","X","X","X","X","X","X","X","X","X","X","X","X"]
[null,null,null,null,"740M6188",0,"GRAFENTHAL MPAC VOR ORT SERVICE UPGRADE","4 JAHRE 13x5 12STD WIEDERHERSTELLUNG DMR","FÜR T2910 S2 AB E5-2650","X","X","X","X","X","X","X","X","X","X","X","X","X","X","X","X","X","X","X","X","X","X","X","X"]
[null,null,null,null,"740M6189",0,"GRAFENTHAL MPAC VOR ORT SERVICE UPGRADE","4 JAHRE 24x7 6STD WIEDERHERSTELLUNG DMR","FÜR T2910 S2 AB E5-2650","X","X","X","X","X","X","X","X","X","X","X","X","X","X","X","X","X","X","X","X","X","X","X","X"]
[null,null,null,null,"740M6190",0,"GRAFENTHAL MPAC VOR ORT SERVICE UPGRADE","5 JAHRE 13x5 24STD WIEDERHERSTELLUNG DMR","FÜR T2910 S2 AB E5-2650","X","X","X","X","X","X","X","X","X","X","X","X","X","X","X","X","X","X","X","X","X","X","X","X"]
[null,null,null,null,"740M6191",0,"GRAFENTHAL MPAC VOR ORT SERVICE UPGRADE","5 JAHRE 13x5 12STD WIEDERHERSTELLUNG DMR","FÜR T2910 S2 AB E5-2650","X","X","X","X","X","X","X","X","X","X","X","X","X","X","X","X","X","X","X","X","X","X","X","X"]
[null,null,null,null,"740M6192",0,"GRAFENTHAL MPAC VOR ORT SERVICE UPGRADE","5 JAHRE 24x7 6STD WIEDERHERSTELLUNG DMR","FÜR T2910 S2 AB E5-2650","X","X","X","X","X","X","X","X","X","X","X","X","X","X","X","X","X","X","X","X","X","X","X","X"]
[null,null,null,null,"CONFIG-TO-ORDER",{"$f":"SUM(F175:F178)","v":0}]
[null,null,null,null,"CTO",0,"HARDWARE ASSEMBLIERUNG",null,null,"X","X","X","X","X","X","X","X","X","X","X","X","X","X","X","X","X","X","X","X","X","X","X","X"]
[null,null,null,null,"CTO1",0,"HARDWARE ASSEMBLIERUNG & FIRMWARE UPDATE",null,null,"X","X","X","X","X","X","X","X","X","X","X","X","X","X","X","X","X","X","X","X","X","X","X","X"]
[null,null,null,null,"CTO2",0,"HARDWARE ASSEMBLIERUNG, FIRMWARE UPDATE & RAID EINRICHTUNG",null,null,"X","X","X","X","X","X","X","X","X","X","X","X","X","X","X","X","X","X","X","X","X","X","X","X"]
[null,null,null,null,"CTO3",0,"HARDWARE ASSEMBLIERUNG, FIRMWARE UPDATE, RAID EINRICHTUNG & OS INSTALLATION",null,null,"X","X","X","X","X","X","X","X","X","X","X","X","X","X","X","X","X","X","X","X","X","X","X","X"]
[null,null,null,null,"USB Drive",{"$f":"SUM(F180:F180)","v":0},"*EXTERNER ANSCHLUSS*"]
[null,null,null,null,"652G6004",0,"GRAFENTHAL USB 3.0 FLASH DRIVE","ULTRA FIT 64GB UP TO 150MB/S"," ","X","X","X","X","X","X","X","X","X","X","X","X","X","X","X","X","X","X","X","X","X","X","X","X"]
[null,null,null,null,"USV- Systeme",{"$f":"SUM(F182:F185)","v":0}]
[null,null,null,null,"132G0150",0,"GRAFENTHAL USV ETR-1500 TOWER RACK LINE","INTERACTIVE 1500VA 1200W PURE SINEWAVE","ECO MODE 23KG CE ROHS GERMAN","X","X","X","X","X","X","X","X","X","X","X","X","X","X","X","X","X","X","X","X","X","X","X","X"]
[null,null,null,null,"132G0300",0,"GRAFENTHAL USV ETR-3000 TOWER RACK LINE","INTERACTIVE 3000VA 2400W PURE SINEWAVE","ECO MODE 35KG CE ROHS GERMAN","X","X","X","X","X","X","X","X","X","X","X","X","X","X","X","X","X","X","X","X","X","X","X","X"]
[null,null,null,null,"113G1150",0,"GRAFENTHAL USV PR-1500-HS PROGRAMMABLE","ECO MODE RACK MOUNT 2U USB RS232 LCD"," ","X","X","X","X","X","X","X","X","X","X","X","X","X","X","X","X","X","X","X","X","X","X","X","X"]
[null,null,null,null,"113G1300",0,"GRAFENTHAL USV PR-3000-HS ONLINE","ECO MODE RACK MOUNT 2U USB RS232 LCD"," ","X","X","X","X","X","X","X","X","X","X","X","X","X","X","X","X","X","X","X","X","X","X","X","X"]
[null,null,null,null,"USV- Zubehör",{"$f":"SUM(F187:F188)","v":0}]
[null,null,null,null,"149G6005",0,"GRAFENTHAL USV SNMP CARD PRO S2","FOR ETR AND PR AND PTR SERIES","MULTI SERVER SHUTDOWN","X","X","X","X","X","X","X","X","X","X","X","X","X","X","X","X","X","X","X","X","X","X","X","X"]
[null,null,null,null,"149G5003",0,"GRAFENTHAL USV ACCESSORY LICENSE FOR","SNMP PRO CARD FOR ETR AND PR SERIES","MULTI SERVER SHUTDOWN","X","X","X","X","X","X","X","X","X","X","X","X","X","X","X","X","X","X","X","X","X","X","X","X"]
[null,null,null,null,"SUMME",1,null,null,null,{"$f":"COUNTIF($J$190:$AG$190,\"<0\")","v":0}]
[null,null,null,null,null,null,null,null,null,{"$f":"SUM(J14:J188)","v":0},0,0,0,0,0,0,0,0,0,0,0,0,0,0,0,0,0,0,0,0,0,0,0]

{"sheet":"R1102 S2","index":4,"n_rows":119,"n_cols":33,"rows_kept":119,"cut":false,"hidden":false,"merged":[[0,4,0,8]]}
[null,null,null,null,"1U Rackserver R1102 S2"]
[]
[null,null,null,null,null,null,null,"• Intel®Xeon®Prozessor E3-1200 v6 Produkt Familie ","more Info"]
[null,null,null,null,null,null,null,"• Quad Gigabit Ethernet LAN"]
[null,null,null,null,null,null,null,"• Zwei performante M.2 Storage Anschlüsse"]
[null,null,null,null,null,null,null,"• Kurze Bauweise von nur 38,1 cm"]
[null,null,null,null,null,null,null,"• Intel® Rapid Storage Technologie","* Felder werden automatisch ausgefüllt"]
[null,null,null,null,null,null,null,null,"*) \"Menge\" filtern um Konfiguration anzuzeigen"]
[]
[]
[null,null,null,null,"Konfigurator",null,{"$f":"'Revision Info'!B10","v":"Revision 15"}]
[null,null,null,null,"ART. NR.","Menge\n     *)","Bezeichnung","Bezeichnung II","Bezeichung III","nicht kombinierbar","nicht konfigurierbar","CPU SLOT2","MEM Slots","PCI x1 Slots","PCI x4 Slots","PCI x8 Slots","PCI x16 Slots","HD Slots HS 3.5 SAS / SATA","HD Slots HS 2,5 SAS /SATA","SSD Slots\nintern","M.2 Slot\nintern","SAS ports HS extern ","SATA port  max.nutzbar","SATA port  ext.  (SSD v HDD)2","SATA Ports\nintern","M2.ports\nintern","HDD Slots HS SATA","HDD Slots NHS SAS","HDD Slots NHS SATA","CacheCade","Cachevault","remote dongle","Frei122"]
[null,null,null,null,"Maschinentyp",{"$f":"SUM(F14:F14)","v":0},null,null,null,"if (Kombi);-1;0","if Menge;-1;0","(Menge x Eigenschaft)","(Menge x Eigenschaft)","(Menge x Eigenschaft)","(Menge x Eigenschaft)","(Menge x Eigenschaft)","(Menge x Eigenschaft)","(Menge x Eigenschaft)","(Menge x Eigenschaft)","(Menge x Eigenschaft)","(Menge x Eigenschaft)","(Menge x Eigenschaft)","(Menge x Eigenschaft)","(Menge x Eigenschaft)","(Menge x Eigenschaft)","(Menge x Eigenschaft)","(Menge x Eigenschaft)","(Menge x Eigenschaft)","(Menge x Eigenschaft)","(Menge x Eigenschaft)","(Menge x Eigenschaft)","(Menge x Eigenschaft)","(Menge x Eigenschaft)"]
[null,null,null,null,"611G8000",0,"GRAFENTHAL CTO RACK SERVER 1U R1102 S2","1 SOCKET INTEL CPU 4xMEM SLOTS","2x2.5\\ BAY 4xGB LAN SINLGE PSU 250W\"",null,null,{"$f":"Tabelle21217[[#This Row],[Menge\n     *)]]*1","v":0},{"$f":"Tabelle21217[[#This Row],[Menge\n     *)]]*4","v":0},{"$f":"Tabelle21217[[#This Row],[Menge\n     *)]]*2","v":0},{"$f":"Tabelle21217[[#This Row],[Menge\n     *)]]*2","v":0},{"$f":"Tabelle21217[[#This Row],[Menge\n     *)]]*2","v":0},{"$f":"Tabelle21217[[#This Row],[Menge\n     *)]]*1","v":0},{"$f":"Tabelle21217[[#This Row],[Menge\n     *)]]*0","v":0},{"$f":"Tabelle21217[[#This Row],[Menge\n     *)]]*2","v":0},{"$f":"Tabelle21217[[#This Row],[Menge\n     *)]]*2","v":0},{"$f":"Tabelle21217[[#This Row],[Menge\n     *)]]*2","v":0},{"$f":"Tabelle21217[[#This Row],[Menge\n     *)]]*0","v":0},{"$f":"Tabelle21217[[#This Row],[Menge\n     *)]]*4","v":0},{"$f":"Tabelle21217[[#This Row],[Menge\n     *)]]*2","v":0},{"$f":"Tabelle21217[[#This Row],[Menge\n     *)]]*4","v":0},{"$f":"Tabelle21217[[#This Row],[Menge\n     *)]]*2","v":0},null,null,null,null,null,{"$f":"Tabelle21217[[#This Row],[Menge\n     *)]]*1","v":0}]
[null,null,null,null,"Prozessor",1]
[null,null,null,null,"656G8000",0,"GRAFENTHAL CPU XEON E3-1220v6 3.00GHz 4C","8MB 72W"," ",null,null,{"$f":"Tabelle21217[[#This Row],[Menge\n     *)]]*-1","v":0}]
[null,null,null,null,"656G8001",0,"GRAFENTHAL CPU XEON E3-1230v6 3.50GHz 4C","8MB 72W"," ",null,null,{"$f":"Tabelle21217[[#This Row],[Menge\n     *)]]*-1","v":0}]
[null,null,null,null,"656G8002",0,"GRAFENTHAL CPU XEON E3-1240v6 3.70GHz 4C","8MB 72W"," ",null,null,{"$f":"Tabelle21217[[#This Row],[Menge\n     *)]]*-1","v":0}]
[null,null,null,null,"656G8004",0,"GRAFENTHAL CPU XEON E3-1270v6 3.80GHz 4C","8MB 72W"," ",null,null,{"$f":"Tabelle21217[[#This Row],[Menge\n     *)]]*-1","v":0}]
[null,null,null,null,"656G8006",0,"GRAFENTHAL CPU XEON E3-1280v6 3.90GHz 4C","8MB 72W"," ",null,null,{"$f":"Tabelle21217[[#This Row],[Menge\n     *)]]*-1","v":0}]
[null,null,null,null,"656G8007",0,"GRAFENTHAL CPU CELERON G3930 2.90GHz 2C","2MB 51W INTEL HD GRAPHICS 610"," ",null,null,{"$f":"Tabelle21217[[#This Row],[Menge\n     *)]]*-1","v":0}]
[null,null,null,null,"656G8008",0,"GRAFENTHAL CPU CELERON G3950 3.00GHz 2C","2MB 51W INTEL HD GRAPHICS 610"," ",null,null,{"$f":"Tabelle21217[[#This Row],[Menge\n     *)]]*-1","v":0}]
[null,null,null,null,"656G8009",0,"GRAFENTHAL CPU PENTIUM G4560 3.50GHz 2C","3MB 54W INTEL HD GRAPHICS 610"," ",null,null,{"$f":"Tabelle21217[[#This Row],[Menge\n     *)]]*-1","v":0}]
[null,null,null,null,"656G8010",0,"GRAFENTHAL CPU PENTIUM G4600 3.60GHz 2C","3MB 51W INTEL HD GRAPHICS 630"," ",null,null,{"$f":"Tabelle21217[[#This Row],[Menge\n     *)]]*-1","v":0}]
[null,null,null,null,"656G8011",0,"GRAFENTHAL CPU PENTIUM G4620 3.70GHz 2C","3MB 51W INTEL HD GRAPHICS 630"," ",null,null,{"$f":"Tabelle21217[[#This Row],[Menge\n     *)]]*-1","v":0}]
[null,null,null,null,"Arbeitsspeicher",{"$f":"SUM(F27:F28)","v":0}]
[null,null,null,null,"652G7004",0,"GRAFENTHAL MEM 8GB DDR4-2400MHz UDIMM","PC4-19200 CL17 DUAL RANKED ECC"," ",null,null,null,{"$f":"Tabelle21217[[#This Row],[Menge\n     *)]]*-1","v":0}]
[null,null,null,null,"652G7005",0,"GRAFENTHAL MEM 16GB DDR4-2400MHz UDIMM","PC4-19200 CL17 DUAL RANKED ECC"," ",null,null,null,{"$f":"Tabelle21217[[#This Row],[Menge\n     *)]]*-1","v":0}]
[null,null,null,null,"Raid Controller",{"$f":"SUM(F30:F31)","v":0},"* wahlweise *"]
[null,null,null,null,"653G5004",0,"GRAFENTHAL RAID CONTROLLER SAS/SATA","12Gb/s/6GB/s 4i 1GB CACHE PCIe 3.0 x8","RAID 0 1 5 6 10 50 60 TYP 9361-4I",{"$f":"IF(COUNTIF($F$30:$F$31,\"<>0\")>1,-1,0)","v":0},null,null,null,{"$f":"Tabelle21217[[#This Row],[Menge\n     *)]]*-1","v":0},{"$f":"Tabelle21217[[#This Row],[Menge\n     *)]]*-1","v":0},{"$f":"Tabelle21217[[#This Row],[Menge\n     *)]]*-1","v":0},null,null,null,null,null,{"$f":"Tabelle21217[[#This Row],[Menge\n     *)]]*2","v":0},null,null,null,null,null,null,null,{"$f":"Tabelle21217[[#This Row],[Menge\n     *)]]*1","v":0},{"$f":"Tabelle21217[[#This Row],[Menge\n     *)]]*1","v":0}]
[null,null,null,null,"653G7004",0,"GRAFENTHAL MEGARAID 9341-4i CONTROLLER","SATA 6GB/S SAS 12GB/S PCIe 3.0 x8","RAID 0 1 5 10 50 TYP 9341-4I",null,null,null,null,{"$f":"Tabelle21217[[#This Row],[Menge\n     *)]]*-1","v":0},{"$f":"Tabelle21217[[#This Row],[Menge\n     *)]]*-1","v":0},{"$f":"Tabelle21217[[#This Row],[Menge\n     *)]]*-1","v":0},null,null,null,null,null,{"$f":"Tabelle21217[[#This Row],[Menge\n     *)]]*2","v":0}]
[null,null,null,null,"HDD / SSD * extern HS *",{"$f":"SUM(#REF!)","v":{"$error":"#REF!"}},"* in externen HotSwap Slots *"]
[null,null,null,null,"SATA SSD 6GB/s *MIDRANGE*",{"$f":"SUM(F34:F35)","v":0}]
[null,null,null,null,"651G7011",0,"GRAFENTHAL SSD 240GB 2.5'' SATA 6GB/S","MIDRANGE 599 TBW"," ",null,null,null,null,null,null,null,null,null,{"$f":"Tabelle21217[[#This Row],[Menge\n     *)]]*-1","v":0},null,null,null,{"$f":"Tabelle21217[[#This Row],[Menge\n     *)]]*-1","v":0},{"$f":"Tabelle21217[[#This Row],[Menge\n     *)]]*-1","v":0}]
[null,null,null,null,"651G7012",0,"GRAFENTHAL SSD 480GB 2.5'' SATA 6GB/S","MIDRANGE 945 TBW"," ",null,null,null,null,null,null,null,null,null,{"$f":"Tabelle21217[[#This Row],[Menge\n     *)]]*-1","v":0},null,null,null,{"$f":"Tabelle21217[[#This Row],[Menge\n     *)]]*-1","v":0},{"$f":"Tabelle21217[[#This Row],[Menge\n     *)]]*-1","v":0}]
[null,null,null,null,"SATA SSD 6GB/s *ENTRY*",{"$f":"SUM(F37:F40)","v":0}]
[null,null,null,null,"651G8024",0,"GRAFENTHAL SSD 256GB SATA3 6GB/S 2.5''","MTBF 1.5M HOURS TBW 300TB"," ",null,null,null,null,null,null,null,null,null,{"$f":"Tabelle21217[[#This Row],[Menge\n     *)]]*-1","v":0},null,null,null,{"$f":"Tabelle21217[[#This Row],[Menge\n     *)]]*-1","v":0},{"$f":"Tabelle21217[[#This Row],[Menge\n     *)]]*-1","v":0}]
[null,null,null,null,"651G8025",0,"GRAFENTHAL SSD 512GB SATA3 6GB/S 2.5''","MTBF 1.5M HOURS TBW 300TB"," ",null,null,null,null,null,null,null,null,null,{"$f":"Tabelle21217[[#This Row],[Menge\n     *)]]*-1","v":0},null,null,null,{"$f":"Tabelle21217[[#This Row],[Menge\n     *)]]*-1","v":0},{"$f":"Tabelle21217[[#This Row],[Menge\n     *)]]*-1","v":0}]
[null,null,null,null,"651G8026",0,"GRAFENTHAL SSD 1TB SATA3 6GB/S 2.5''","MTBF 1.5M HOURS TBW 300TB"," ",null,null,null,null,null,null,null,null,null,{"$f":"Tabelle21217[[#This Row],[Menge\n     *)]]*-1","v":0},null,null,null,{"$f":"Tabelle21217[[#This Row],[Menge\n     *)]]*-1","v":0},{"$f":"Tabelle21217[[#This Row],[Menge\n     *)]]*-1","v":0}]
[null,null,null,null,"651G8027",0,"GRAFENTHAL SSD 2TB SATA3 6GB/S 2.5''","MTBF 1.5M HOURS TBW 300TB"," ",null,null,null,null,null,null,null,null,null,{"$f":"Tabelle21217[[#This Row],[Menge\n     *)]]*-1","v":0},null,null,null,{"$f":"Tabelle21217[[#This Row],[Menge\n     *)]]*-1","v":0},{"$f":"Tabelle21217[[#This Row],[Menge\n     *)]]*-1","v":0}]
[null,null,null,null,"SATA HDD 6GB/s",{"$f":"SUM(F42)","v":0}]
[null,null,null,null,"651G6002",0,"GRAFENTHAL HDD 1TB 2,5'' SATA 7200RPM","32MB CACHE 6GB/S BAUHÖHE 9.5MM","FUER SERVER UND WORKSTATION",null,null,null,null,null,null,null,null,null,{"$f":"Tabelle21217[[#This Row],[Menge\n     *)]]*-1","v":0},null,null,null,{"$f":"Tabelle21217[[#This Row],[Menge\n     *)]]*-1","v":0},{"$f":"Tabelle21217[[#This Row],[Menge\n     *)]]*-1","v":0}]
[null,null,null,null,"SAS 2,5\" 10k 12GB/s",{"$f":"SUM(F44:F49)","v":0}]
[null,null,null,null,"651G8020",0,"GRAFENTHAL HDD 300GB 10K 2.5'' SAS","12GB/S"," ",null,null,null,null,null,null,null,null,null,{"$f":"Tabelle21217[[#This Row],[Menge\n     *)]]*-1","v":0},null,null,{"$f":"Tabelle21217[[#This Row],[Menge\n     *)]]*-1","v":0}]
[null,null,null,null,"651G8005",0,"GRAFENTHAL HDD 600GB 10K 2.5\\ SAS 12GB/S\""," "," ",null,null,null,null,null,null,null,null,null,{"$f":"Tabelle21217[[#This Row],[Menge\n     *)]]*-1","v":0},null,null,{"$f":"Tabelle21217[[#This Row],[Menge\n     *)]]*-1","v":0}]
[null,null,null,null,"651G8006",0,"GRAFENTHAL HDD 900GB 10K 2.5\\ SAS 12GB/S\""," "," ",null,null,null,null,null,null,null,null,null,{"$f":"Tabelle21217[[#This Row],[Menge\n     *)]]*-1","v":0},null,null,{"$f":"Tabelle21217[[#This Row],[Menge\n     *)]]*-1","v":0}]
[null,null,null,null,"651G8007",0,"GRAFENTHAL HDD 1.2TB 10K 2.5\\ SAS 12GB/S\""," "," ",null,null,null,null,null,null,null,null,null,{"$f":"Tabelle21217[[#This Row],[Menge\n     *)]]*-1","v":0},null,null,{"$f":"Tabelle21217[[#This Row],[Menge\n     *)]]*-1","v":0}]
[null,null,null,null,"651G8021",0,"GRAFENTHAL HDD 1.8TB 10K 2.5'' SAS","12GB/S"," ",null,null,null,null,null,null,null,null,null,{"$f":"Tabelle21217[[#This Row],[Menge\n     *)]]*-1","v":0},null,null,{"$f":"Tabelle21217[[#This Row],[Menge\n     *)]]*-1","v":0}]
[null,null,null,null,"651G8022",0,"GRAFENTHAL HDD 2.4TB 10K 2.5'' SAS","12GB/S"," ",null,null,null,null,null,null,null,null,null,{"$f":"Tabelle21217[[#This Row],[Menge\n     *)]]*-1","v":0},null,null,{"$f":"Tabelle21217[[#This Row],[Menge\n     *)]]*-1","v":0}]
[null,null,null,null,"SAS 2,5\" 15k 12GB/s",{"$f":"SUM(F51:F53)","v":0}]
[null,null,null,null,"651G8003",0,"GRAFENTHAL HDD 300GB 15K 2.5\\ SAS 12GB/S\""," "," ",null,null,null,null,null,null,null,null,null,{"$f":"Tabelle21217[[#This Row],[Menge\n     *)]]*-1","v":0},null,null,{"$f":"Tabelle21217[[#This Row],[Menge\n     *)]]*-1","v":0}]
[null,null,null,null,"651G8004",0,"GRAFENTHAL HDD 600GB 15K 2.5\\ SAS 12GB/S\""," "," ",null,null,null,null,null,null,null,null,null,{"$f":"Tabelle21217[[#This Row],[Menge\n     *)]]*-1","v":0},null,null,{"$f":"Tabelle21217[[#This Row],[Menge\n     *)]]*-1","v":0}]
[null,null,null,null,"651G8019",0,"GRAFENTHAL HDD 900GB 15K 2.5'' SAS","12GB/S"," ",null,null,null,null,null,null,null,null,null,{"$f":"Tabelle21217[[#This Row],[Menge\n     *)]]*-1","v":0},null,null,{"$f":"Tabelle21217[[#This Row],[Menge\n     *)]]*-1","v":0}]
[null,null,null,null,"SAS SSD  12GB/s *ENTERPRISE*",{"$f":"SUM(F55:F58)","v":0}]
[null,null,null,null,"651G7004",0,"GRAFENTHAL SSD 480GB 2,5'' SAS 12GB/S","MIDRANGE DWPD 1"," ",null,null,null,null,null,null,null,null,null,{"$f":"Tabelle21217[[#This Row],[Menge\n     *)]]*-1","v":0},null,null,{"$f":"Tabelle21217[[#This Row],[Menge\n     *)]]*-1","v":0}]
[null,null,null,null,"651G7005",0,"GRAFENTHAL SSD 960GB 2,5'' SAS 12GB/S","MIDRANGE DWPD 1"," ",null,null,null,null,null,null,null,null,null,{"$f":"Tabelle21217[[#This Row],[Menge\n     *)]]*-1","v":0},null,null,{"$f":"Tabelle21217[[#This Row],[Menge\n     *)]]*-1","v":0}]
[null,null,null,null,"651G7006",0,"GRAFENTHAL SSD 1920GB 2,5'' SAS 12GB/S","MIDRANGE DWPD 1"," ",null,null,null,null,null,null,null,null,null,{"$f":"Tabelle21217[[#This Row],[Menge\n     *)]]*-1","v":0},null,null,{"$f":"Tabelle21217[[#This Row],[Menge\n     *)]]*-1","v":0}]
[null,null,null,null,"651G7007",0,"GRAFENTHAL SSD 3840GB 2,5'' SAS 12GB/S","MIDRANGE DWPD 1"," ",null,null,null,null,null,null,null,null,null,{"$f":"Tabelle21217[[#This Row],[Menge\n     *)]]*-1","v":0},null,null,{"$f":"Tabelle21217[[#This Row],[Menge\n     *)]]*-1","v":0}]
[null,null,null,null,"HDD / SSD * intern NHS *",{"$f":"SUM(F61:F63)","v":0},"* in internen Slots *"]
[null,null,null,null,"SATA SSD 6GB/s *MIDRANGE*",{"$f":"SUM(F61:F63)","v":0}]
[null,null,null,null,"651G7014",0,"GRAFENTHAL SSD 120GB 2,5'' SFF SATA 6G","READ 510MB WRITE 485MB DWPD 3.6"," ",null,null,null,null,null,null,null,null,null,null,{"$f":"Tabelle21217[[#This Row],[Menge\n     *)]]*-1","v":0},null,null,{"$f":"Tabelle21217[[#This Row],[Menge\n     *)]]*-1","v":0},null,{"$f":"Tabelle21217[[#This Row],[Menge\n     *)]]*-1","v":0}]
[null,null,null,null,"651G7017",0,"GRAFENTHAL SSD 960GB 2,5'' SFF SATA 6G","READ 510MB WRITE 485MB DWPD 3.6"," ",null,null,null,null,null,null,null,null,null,null,{"$f":"Tabelle21217[[#This Row],[Menge\n     *)]]*-1","v":0},null,null,{"$f":"Tabelle21217[[#This Row],[Menge\n     *)]]*-1","v":0},null,{"$f":"Tabelle21217[[#This Row],[Menge\n     *)]]*-1","v":0}]
[null,null,null,null,"651G7018",0,"GRAFENTHAL SSD 1.92TB 2,5'' SFF SATA 6G","READ 510MB WRITE 485MB DWPD 3.6"," ",null,null,null,null,null,null,null,null,null,null,{"$f":"Tabelle21217[[#This Row],[Menge\n     *)]]*-1","v":0},null,null,{"$f":"Tabelle21217[[#This Row],[Menge\n     *)]]*-1","v":0},null,{"$f":"Tabelle21217[[#This Row],[Menge\n     *)]]*-1","v":0}]
[null,null,null,null,"SATA SSD 6GB/s *ENTRY*",{"$f":"SUM(F65:F68)","v":0},{"$error":"#N/A"}]
[null,null,null,null,"651G7011",0,"GRAFENTHAL SSD 240GB 2.5'' SATA 6GB/S","MIDRANGE 599 TBW"," ",null,null,null,null,null,null,null,null,null,null,{"$f":"Tabelle21217[[#This Row],[Menge\n     *)]]*-1","v":0},null,null,{"$f":"Tabelle21217[[#This Row],[Menge\n     *)]]*-1","v":0},null,{"$f":"Tabelle21217[[#This Row],[Menge\n     *)]]*-1","v":0}]
[null,null,null,null,"651G7012",0,"GRAFENTHAL SSD 480GB 2.5'' SATA 6GB/S","MIDRANGE 945 TBW"," ",null,null,null,null,null,null,null,null,null,null,{"$f":"Tabelle21217[[#This Row],[Menge\n     *)]]*-1","v":0},null,null,{"$f":"Tabelle21217[[#This Row],[Menge\n     *)]]*-1","v":0},null,{"$f":"Tabelle21217[[#This Row],[Menge\n     *)]]*-1","v":0}]
[null,null,null,null,"651G6049",0,"GRAFENTHAL SSD 512GB 2,5'' SATA 6GB/S","ENTRY CLASS SSD DWPD 0,35","READ INTENSIVE AND BOOT APPLICATION",null,null,null,null,null,null,null,null,null,null,{"$f":"Tabelle21217[[#This Row],[Menge\n     *)]]*-1","v":0},null,null,{"$f":"Tabelle21217[[#This Row],[Menge\n     *)]]*-1","v":0},null,{"$f":"Tabelle21217[[#This Row],[Menge\n     *)]]*-1","v":0}]
[null,null,null,null,"651G6050",0,"GRAFENTHAL SSD 1 TB  2,5'' SATA 6GB/S","ENTRY CLASS SSD DWPD 0,35","READ INTENSIVE AND BOOT APPLICATION",null,null,null,null,null,null,null,null,null,null,{"$f":"Tabelle21217[[#This Row],[Menge\n     *)]]*-1","v":0},null,null,{"$f":"Tabelle21217[[#This Row],[Menge\n     *)]]*-1","v":0},null,{"$f":"Tabelle21217[[#This Row],[Menge\n     *)]]*-1","v":0}]
[null,null,null,null,"SSD M.2 SATA 6GB/s",{"$f":"SUM(F70:F72)","v":0}]
[null,null,null,null,"651G8000",0,"GRAFENTHAL SSD 256GB M.2 2280 SATA 6GB/S","256BIT-AES MTBF 1.6M HOURS TBW 144TB"," ",null,null,null,null,null,null,null,null,null,null,null,{"$f":"Tabelle21217[[#This Row],[Menge\n     *)]]*-1","v":0},null,null,null,null,{"$f":"Tabelle21217[[#This Row],[Menge\n     *)]]*-1","v":0}]
[null,null,null,null,"651G8001",0,"GRAFENTHAL SSD 512GB M.2 2280 SATA 6GB/S","256BIT-AES MTBF 1.6M HOURS TBW 288TB"," ",null,null,null,null,null,null,null,null,null,null,null,{"$f":"Tabelle21217[[#This Row],[Menge\n     *)]]*-1","v":0},null,null,null,null,{"$f":"Tabelle21217[[#This Row],[Menge\n     *)]]*-1","v":0}]
[null,null,null,null,"651G8002",0,"GRAFENTHAL SSD 1TB M.2 2280 SATA 6GB/S","256BIT-AES TCG OPAL 2.0 MTBF 1.5M HOURS"," ",null,null,null,null,null,null,null,null,null,null,null,{"$f":"Tabelle21217[[#This Row],[Menge\n     *)]]*-1","v":0},null,null,null,null,{"$f":"Tabelle21217[[#This Row],[Menge\n     *)]]*-1","v":0}]
[null,null,null,null,"SSD M.2 NVMe",{"$f":"SUM(F74:F76)","v":0}]
[null,null,null,null,"651G7000",0,"GRAFENTHAL SSD 512GB NVME M.2","PCIe 3.0 x4 READ 3500MB/S WRITE 2100MB/S"," ",null,null,null,null,null,null,null,null,null,null,null,{"$f":"Tabelle21217[[#This Row],[Menge\n     *)]]*-1","v":0},null,null,null,null,{"$f":"Tabelle21217[[#This Row],[Menge\n     *)]]*-1","v":0}]
[null,null,null,null,"651G7001",0,"GRAFENTHAL SSD 1TB NVME M.2","PCIe 3.0 x4 READ 3500MB/S WRITE 2100MB/S"," ",null,null,null,null,null,null,null,null,null,null,null,{"$f":"Tabelle21217[[#This Row],[Menge\n     *)]]*-1","v":0},null,null,null,null,{"$f":"Tabelle21217[[#This Row],[Menge\n     *)]]*-1","v":0}]
[null,null,null,null,"651G7002",0,"GRAFENTHAL SSD 2TB NVME M.2","PCIe 3.0 x4 READ 3500MB/S WRITE 2100MB/S"," ",null,null,null,null,null,null,null,null,null,null,null,{"$f":"Tabelle21217[[#This Row],[Menge\n     *)]]*-1","v":0},null,null,null,null,{"$f":"Tabelle21217[[#This Row],[Menge\n     *)]]*-1","v":0}]
[null,null,null,null,"(Kupfer-) Netzkarte",{"$f":"SUM(F78:F79)","v":0}]
[null,null,null,null,"653G7002",0,"GRAFENTHAL ETHERNET ADAPTER DUAL PORT","RJ45 2x10GBE X550-T2 PCIe 3.0 x4"," ",null,null,null,null,{"$f":"Tabelle21217[[#This Row],[Menge\n     *)]]*-1","v":0},{"$f":"Tabelle21217[[#This Row],[Menge\n     *)]]*-1","v":0}]
[null,null,null,null,"659G8015",0,"GRAFENTHAL GIGABIT ETHERNET APDATER","I350-T4V2 4x RJ-45 PCIe x4 COPPER"," ",null,null,null,null,{"$f":"Tabelle21217[[#This Row],[Menge\n     *)]]*-1","v":0},{"$f":"Tabelle21217[[#This Row],[Menge\n     *)]]*-1","v":0}]
[null,null,null,null,"(SFP+)Netzwerkkarte",{"$f":"SUM(F81)","v":0}]
[null,null,null,null,"653G7003",0,"GRAFENTHAL ETHERNET ADAPTER 2-PORT 10GBE","INTEL X520 FIBRE SFP+ PCIe x8 LP"," ",null,null,null,null,{"$f":"Tabelle21217[[#This Row],[Menge\n     *)]]*-1","v":0},{"$f":"Tabelle21217[[#This Row],[Menge\n     *)]]*-1","v":0},{"$f":"Tabelle21217[[#This Row],[Menge\n     *)]]*-1","v":0}]
[null,null,null,null,"KVM Upgrade",{"$f":"SUM(F83)","v":0}]
[null,null,null,null,"653G6006",0,"GRAFENTHAL KVM UPGRADE CHIP","FOR R1104 S2"," ",null,null,null,null,null,null,null,null,null,null,null,null,null,null,null,null,null,null,null,null,null,null,{"$f":"Tabelle21217[[#This Row],[Menge\n     *)]]*-1","v":0}]
[null,null,null,null,"MPAC",{"$f":"SUM(F85)","v":0}]
[null,null,null,null,"740M6247",0,"GRAFENTHAL MPAC VOR ORT SERVICE UPGRADE","3 JAHRE 13x5 24STD WIEDERHERSTELLUNG","FÜR GRAFENTHAL R1102 S2"]
[null,null,null,null,"740M6248",0,"GRAFENTHAL MPAC VOR ORT SERVICE UPGRADE","3 JAHRE 13x5 12STD WIEDERHERSTELLUNG","FÜR GRAFENTHAL R1102 S2"]
[null,null,null,null,"740M6249",0,"GRAFENTHAL MPAC VOR ORT SERVICE UPGRADE","3 JAHRE 24x7 6STD WIEDERHERSTELLUNG","FÜR GRAFENTHAL R1102 S2"]
[null,null,null,null,"740M6250",0,"GRAFENTHAL MPAC VOR ORT SERVICE UPGRADE","4 JAHRE 13x5 24STD WIEDERHERSTELLUNG","FÜR GRAFENTHAL R1102 S2"]
[null,null,null,null,"740M6251",0,"GRAFENTHAL MPAC VOR ORT SERVICE UPGRADE","4 JAHRE 13x5 12STD WIEDERHERSTELLUNG","FÜR GRAFENTHAL R1102 S2"]
[null,null,null,null,"740M6252",0,"GRAFENTHAL MPAC VOR ORT SERVICE UPGRADE","4 JAHRE 24x7 6STD WIEDERHERSTELLUNG","FÜR GRAFENTHAL R1102 S2"]
[null,null,null,null,"740M6253",0,"GRAFENTHAL MPAC VOR ORT SERVICE UPGRADE","5 JAHRE 13x5 24STD WIEDERHERSTELLUNG","FÜR GRAFENTHAL R1102 S2"]
[null,null,null,null,"740M6254",0,"GRAFENTHAL MPAC VOR ORT SERVICE UPGRADE","5 JAHRE 13x5 12STD WIEDERHERSTELLUNG","FÜR GRAFENTHAL R1102 S2"]
[null,null,null,null,"740M6255",0,"GRAFENTHAL MPAC VOR ORT SERVICE UPGRADE","5 JAHRE 24x7 6STD WIEDERHERSTELLUNG","FÜR GRAFENTHAL R1102 S2"]
[null,null,null,null,"740M6256",0,"GRAFENTHAL MPAC VOR ORT SERVICE UPGRADE","3 JAHRE 13x5 24STD WIEDERHERSTELLUNG DMR","FÜR GRAFENTHAL R1102 S2"]
[null,null,null,null,"740M6257",0,"GRAFENTHAL MPAC VOR ORT SERVICE UPGRADE","3 JAHRE 13x5 12STD WIEDERHERSTELLUNG DMR","FÜR GRAFENTHAL R1102 S2"]
[null,null,null,null,"740M6258",0,"GRAFENTHAL MPAC VOR ORT SERVICE UPGRADE","3 JAHRE 24x7 6STD WIEDERHERSTELLUNG DMR","FÜR GRAFENTHAL R1102 S2"]
[null,null,null,null,"740M6259",0,"GRAFENTHAL MPAC VOR ORT SERVICE UPGRADE","4 JAHRE 13x5 24STD WIEDERHERSTELLUNG DMR","FÜR GRAFENTHAL R1102 S2"]
[null,null,null,null,"740M6260",0,"GRAFENTHAL MPAC VOR ORT SERVICE UPGRADE","4 JAHRE 13x5 12STD WIEDERHERSTELLUNG DMR","FÜR GRAFENTHAL R1102 S2"]
[null,null,null,null,"740M6261",0,"GRAFENTHAL MPAC VOR ORT SERVICE UPGRADE","4 JAHRE 24x7 6STD WIEDERHERSTELLUNG DMR","FÜR GRAFENTHAL R1102 S2"]
[null,null,null,null,"740M6262",0,"GRAFENTHAL MPAC VOR ORT SERVICE UPGRADE","5 JAHRE 13x5 24STD WIEDERHERSTELLUNG DMR","FÜR GRAFENTHAL R1102 S2"]
[null,null,null,null,"740M6263",0,"GRAFENTHAL MPAC VOR ORT SERVICE UPGRADE","5 JAHRE 13x5 12STD WIEDERHERSTELLUNG DMR","FÜR GRAFENTHAL R1102 S2"]
[null,null,null,null,"740M6264",0,"GRAFENTHAL MPAC VOR ORT SERVICE UPGRADE","5 JAHRE 24x7 6STD WIEDERHERSTELLUNG DMR","FÜR GRAFENTHAL R1102 S2"]
[null,null,null,null,"CONFIG-TO-ORDER",{"$f":"SUM(F104:F107)","v":0}]
[null,null,null,null,"CTO",0,"HARDWARE ASSEMBLIERUNG"]
[null,null,null,null,"CTO1",0,"HARDWARE ASSEMBLIERUNG & FIRMWARE UPDATE"]
[null,null,null,null,"CTO2",0,"HARDWARE ASSEMBLIERUNG, FIRMWARE UPDATE & RAID EINRICHTUNG"]
[null,null,null,null,"CTO3",0,"HARDWARE ASSEMBLIERUNG, FIRMWARE UPDATE, RAID EINRICHTUNG & OS INSTALLATION"]
[null,null,null,null,"USB Drive",{"$f":"SUM(F109)","v":0}]
[null,null,null,null,"652G6004",0,"GRAFENTHAL USB 3.0 FLASH DRIVE","ULTRA FIT 64GB UP TO 150MB/S"," "]
[null,null,null,null,"USV- Systeme",{"$f":"SUM(F111:F114)","v":0}]
[null,null,null,null,"132G0150",0,"GRAFENTHAL USV ETR-1500 TOWER RACK LINE","INTERACTIVE 1500VA 1200W PURE SINEWAVE","ECO MODE 23KG CE ROHS GERMAN"]
[null,null,null,null,"132G0300",0,"GRAFENTHAL USV ETR-3000 TOWER RACK LINE","INTERACTIVE 3000VA 2400W PURE SINEWAVE","ECO MODE 35KG CE ROHS GERMAN"]
[null,null,null,null,"113G1150",0,"GRAFENTHAL USV PR-1500-HS PROGRAMMABLE","ECO MODE RACK MOUNT 2U USB RS232 LCD"," "]
[null,null,null,null,"113G1300",0,"GRAFENTHAL USV PR-3000-HS ONLINE","ECO MODE RACK MOUNT 2U USB RS232 LCD"," "]
[null,null,null,null,"USV- Zubehör",{"$f":"SUM(F116:F117)","v":0}]
[null,null,null,null,"149G6005",0,"GRAFENTHAL USV SNMP CARD PRO S2","FOR ETR AND PR AND PTR SERIES","MULTI SERVER SHUTDOWN"]
[null,null,null,null,"149G5003",0,"GRAFENTHAL USV ACCESSORY LICENSE FOR","SNMP PRO CARD FOR ETR AND PR SERIES","MULTI SERVER SHUTDOWN"]
[null,null,null,null,"SUMME",1,null,null,null,{"$f":"COUNTIF(J119:AG119,\"<0\")","v":0}]
[null,null,null,null,null,null,null,null,null,{"$f":"SUM(J14:J117)","v":0},0,0,0,0,0,0,0,0,0,0,0,0,{"$f":"SUM(W14:W117)","v":0},0,0,0,0,0,0,0,0,0,0]

{"sheet":"R1104 S2","index":5,"n_rows":142,"n_cols":40,"rows_kept":142,"cut":false,"hidden":false,"merged":[[0,4,0,8]]}
[null,null,null,null,"1U Rackserver R1104 S2"]
[]
[null,null,null,null,null,null,null,"Intel Xeon Prozessor E3-1200 v5 Architektur","more Info"]
[null,null,null,null,null,null,null,"zwei M.2 Storage Ports (2280/2260/2242)"]
[null,null,null,null,null,null,null,"bis zu 40 TB Storage auf einer Höheneinheit"]
[null,null,null,null,null,null,null,"Intel Rapid Storage Technologie Software RAID 0, 1, 5, 10"]
[null,null,null,null,null,null,null,"Redundante Netzteile (modellabhängig)","* Felder werden automatisch ausgefüllt"]
[null,null,null,null,null,null,null,null,"*) \"Menge\" filtern um Konfiguration anzuzeigen"]
[]
[]
[null,null,null,null,"Konfigurator",null,{"$f":"'Revision Info'!B10","v":"Revision 15"}]
[null,null,null,null,"ART. NR.","Menge\n    *)","Bezeichnung","Bezeichnung II","Bezeichung III","nicht kombinierbar","nicht konfigurierbar","CPU SLOT","interner SSD Slot","Frei3","Frei4","Frei5","Frei6","Frei7","Frei8","Frei9","Frei10","SATA Ports","MEM Slots","SSD Slots","HDD Slots HS 2.5","HDD Slots HS 3.5","HDD Slots HS SAS","HDD Slots HS SATA","HDD Slots NHS SAS","HDD Slots NHS SATA","SAS Ports","CacheCade","3,5 Slots","Cachevault","PCI x1 Slots","PCI x4 Slots","PCI x8 Slots","PCI x16 Slots","M.2 Slot","Frei12"]
[null,null,null,null,"Maschinentyp",{"$f":"SUM(F14:F15)","v":0},null,null,null,"if (Kombi);-1;0","if Menge;-1;0","(Menge x Eigenschaft)","(Menge x Eigenschaft)","(Menge x Eigenschaft)","(Menge x Eigenschaft)","(Menge x Eigenschaft)","(Menge x Eigenschaft)","(Menge x Eigenschaft)","(Menge x Eigenschaft)","(Menge x Eigenschaft)","(Menge x Eigenschaft)","(Menge x Eigenschaft)","(Menge x Eigenschaft)","(Menge x Eigenschaft)","(Menge x Eigenschaft)","(Menge x Eigenschaft)","(Menge x Eigenschaft)","(Menge x Eigenschaft)","(Menge x Eigenschaft)","(Menge x Eigenschaft)","(Menge x Eigenschaft)","(Menge x Eigenschaft)","(Menge x Eigenschaft)","(Menge x Eigenschaft)","(Menge x Eigenschaft)","(Menge x Eigenschaft)","(Menge x Eigenschaft)","(Menge x Eigenschaft)","(Menge x Eigenschaft)","(Menge x Eigenschaft)"]
[null,null,null,null,"611G7000",0,"GRAFENTHAL CTO RACK SERVER 1U R1104 S2","INTEL E3-1200V5 SOCKET 4xMEM SLOTS","4x3,5\\ 2xM.2 4xGB LAN SINGLE PSU 400W\"",null,null,{"$f":"Tabelle212[[#This Row],[Menge\n    *)]]*1","v":0},{"$f":"Tabelle212[[#This Row],[Menge\n    *)]]*4","v":0},null,null,null,null,null,null,null,null,{"$f":"Tabelle212[[#This Row],[Menge\n    *)]]*6","v":0},{"$f":"Tabelle212[[#This Row],[Menge\n    *)]]*4","v":0},null,{"$f":"Tabelle212[[#This Row],[Menge\n    *)]]*5","v":0},{"$f":"Tabelle212[[#This Row],[Menge\n    *)]]*4","v":0},null,null,null,null,{"$f":"Tabelle212[[#This Row],[Menge\n    *)]]*0","v":0},null,null,null,{"$f":"Tabelle212[[#This Row],[Menge\n    *)]]*2","v":0},{"$f":"Tabelle212[[#This Row],[Menge\n    *)]]*2","v":0},{"$f":"Tabelle212[[#This Row],[Menge\n    *)]]*2","v":0},{"$f":"Tabelle212[[#This Row],[Menge\n    *)]]*1","v":0},{"$f":"Tabelle212[[#This Row],[Menge\n    *)]]*2","v":0}]
[null,null,null,null,"611G7002",0,"GRAFENTHAL CTO RACK SERVER 1U R1104 S2","INTEL E3-1200V5 SOCKET 4xMEM SLOTS","2xM.2  4xGIGABIT RED PSU 450W (2/2)",null,null,{"$f":"Tabelle212[[#This Row],[Menge\n    *)]]*1","v":0},{"$f":"Tabelle212[[#This Row],[Menge\n    *)]]*4","v":0},null,null,null,null,null,null,null,null,{"$f":"Tabelle212[[#This Row],[Menge\n    *)]]*5","v":0},{"$f":"Tabelle212[[#This Row],[Menge\n    *)]]*4","v":0},null,{"$f":"Tabelle212[[#This Row],[Menge\n    *)]]*5","v":0},{"$f":"Tabelle212[[#This Row],[Menge\n    *)]]*4","v":0},null,null,null,null,{"$f":"Tabelle212[[#This Row],[Menge\n    *)]]*0","v":0},null,null,null,{"$f":"Tabelle212[[#This Row],[Menge\n    *)]]*2","v":0},{"$f":"Tabelle212[[#This Row],[Menge\n    *)]]*2","v":0},{"$f":"Tabelle212[[#This Row],[Menge\n    *)]]*2","v":0},{"$f":"Tabelle212[[#This Row],[Menge\n    *)]]*1","v":0},{"$f":"Tabelle212[[#This Row],[Menge\n    *)]]*2","v":0}]
[null,null,null,null,"Prozessor",{"$f":"SUM(F17:F28)","v":0}]
[null,null,null,null,"656G8000",0,"GRAFENTHAL CPU XEON E3-1220v6 3.00GHz 4C","8MB 72W"," ",{"$f":"IF(COUNTIF(F17:F28,\">0\")>1,-1,0)","v":0},null,{"$f":"Tabelle212[[#This Row],[Menge\n    *)]]*-1","v":0}]
[null,null,null,null,"656G8001",0,"GRAFENTHAL CPU XEON E3-1230v6 3.50GHz 4C","8MB 72W"," ",null,null,{"$f":"Tabelle212[[#This Row],[Menge\n    *)]]*-1","v":0}]
[null,null,null,null,"656G8002",0,"GRAFENTHAL CPU XEON E3-1240v6 3.70GHz 4C","8MB 72W"," ",null,null,{"$f":"Tabelle212[[#This Row],[Menge\n    *)]]*-1","v":0}]
[null,null,null,null,"656G8003",0,"GRAFENTHAL CPU XEON E3-1245v6 3.70GHz 4C","8MB 73W INTEL HD GRAPHICS P630"," ",null,null,{"$f":"Tabelle212[[#This Row],[Menge\n    *)]]*-1","v":0}]
[null,null,null,null,"656G8004",0,"GRAFENTHAL CPU XEON E3-1270v6 3.80GHz 4C","8MB 72W"," ",null,null,{"$f":"Tabelle212[[#This Row],[Menge\n    *)]]*-1","v":0}]
[null,null,null,null,"656G8005",0,"GRAFENTHAL CPU XEON E3-1275v6 3.80GHz 4C","8MB 73W INTEL HD GRAPHICS P630"," ",null,null,{"$f":"Tabelle212[[#This Row],[Menge\n    *)]]*-1","v":0}]
[null,null,null,null,"656G8006",0,"GRAFENTHAL CPU XEON E3-1280v6 3.90GHz 4C","8MB 72W"," ",null,null,{"$f":"Tabelle212[[#This Row],[Menge\n    *)]]*-1","v":0}]
[null,null,null,null,"656G8007",0,"GRAFENTHAL CPU CELERON G3930 2.90GHz 2C","2MB 51W INTEL HD GRAPHICS 610"," ",null,null,{"$f":"Tabelle212[[#This Row],[Menge\n    *)]]*-1","v":0}]
[null,null,null,null,"656G8008",0,"GRAFENTHAL CPU CELERON G3950 3.00GHz 2C","2MB 51W INTEL HD GRAPHICS 610"," ",null,null,{"$f":"Tabelle212[[#This Row],[Menge\n    *)]]*-1","v":0}]
[null,null,null,null,"656G8009",0,"GRAFENTHAL CPU PENTIUM G4560 3.50GHz 2C","3MB 54W INTEL HD GRAPHICS 610"," ",null,null,{"$f":"Tabelle212[[#This Row],[Menge\n    *)]]*-1","v":0}]
[null,null,null,null,"656G8010",0,"GRAFENTHAL CPU PENTIUM G4600 3.60GHz 2C","3MB 51W INTEL HD GRAPHICS 630"," ",null,null,{"$f":"Tabelle212[[#This Row],[Menge\n    *)]]*-1","v":0}]
[null,null,null,null,"656G8011",0,"GRAFENTHAL CPU PENTIUM G4620 3.70GHz 2C","3MB 51W INTEL HD GRAPHICS 630"," ",null,null,{"$f":"Tabelle212[[#This Row],[Menge\n    *)]]*-1","v":0}]
[null,null,null,null,"Arbeitsspeicher",{"$f":"SUM(F30:F31)","v":0},"*Speicher dürfen nicht gemischt werden*"]
[null,null,null,null,"652G7004",0,"GRAFENTHAL MEM 8GB DDR4-2400MHz UDIMM","PC4-19200 CL17 DUAL RANKED ECC"," ",{"$f":"IF(COUNTIF(F30:F31,\">0\")>1,-1,0)","v":0},null,null,null,null,null,null,null,null,null,null,null,null,{"$f":"Tabelle212[[#This Row],[Menge\n    *)]]*-1","v":0}]
[null,null,null,null,"652G7005",0,"GRAFENTHAL MEM 16GB DDR4-2400MHz UDIMM","PC4-19200 CL17 DUAL RANKED ECC"," ",null,null,null,null,null,null,null,null,null,null,null,null,null,{"$f":"Tabelle212[[#This Row],[Menge\n    *)]]*-1","v":0}]
[null,null,null,null,"Raid Controller",{"$f":"SUM(F33:F38)","v":0}]
[null,null,null,null,"653G5004",0,"GRAFENTHAL RAID CONTROLLER SAS/SATA","12Gb/s/6GB/s 4i 1GB CACHE PCIe 3.0 x8","RAID 0 1 5 6 10 50 60 TYP 9361-4I",null,null,null,null,null,null,null,null,null,null,null,null,null,null,null,null,null,null,null,null,null,{"$f":"Tabelle212[[#This Row],[Menge\n    *)]]*4","v":0},{"$f":"Tabelle212[[#This Row],[Menge\n    *)]]*1","v":0},null,{"$f":"Tabelle212[[#This Row],[Menge\n    *)]]*1","v":0},{"$f":"Tabelle212[[#This Row],[Menge\n    *)]]*-1","v":0},{"$f":"Tabelle212[[#This Row],[Menge\n    *)]]*-1","v":0},{"$f":"Tabelle212[[#This Row],[Menge\n    *)]]*-1","v":0}]
[null,null,null,null,"653G5007",0,"GRAFENTHAL RAID CONTROLLER SAS/SATA","12GB/S /6GB/S 8i 1GB CACHE","RAID 0 1  5 6 10 50 60 TYP 9361-8I",null,null,null,null,null,null,null,null,null,null,null,null,null,null,null,null,null,null,null,null,null,{"$f":"Tabelle212[[#This Row],[Menge\n    *)]]*5","v":0},{"$f":"Tabelle212[[#This Row],[Menge\n    *)]]*1","v":0},null,{"$f":"Tabelle212[[#This Row],[Menge\n    *)]]*1","v":0},{"$f":"Tabelle212[[#This Row],[Menge\n    *)]]*-1","v":0},{"$f":"Tabelle212[[#This Row],[Menge\n    *)]]*-1","v":0},{"$f":"Tabelle212[[#This Row],[Menge\n    *)]]*-1","v":0}]
[null,null,null,null,"653G7004",0,"GRAFENTHAL MEGARAID 9341-4i CONTROLLER","SATA 6GB/S SAS 12GB/S PCIe 3.0 x8","RAID 0 1 5 10 50 TYP 9341-4I",null,null,null,null,null,null,null,null,null,null,null,null,null,null,null,null,null,null,null,null,null,{"$f":"Tabelle212[[#This Row],[Menge\n    *)]]*4","v":0},null,null,null,{"$f":"Tabelle212[[#This Row],[Menge\n    *)]]*-1","v":0},{"$f":"Tabelle212[[#This Row],[Menge\n    *)]]*-1","v":0},{"$f":"Tabelle212[[#This Row],[Menge\n    *)]]*-1","v":0}]
[null,null,null,null,"653G5008",0,"GRAFENTHAL RAID CONTROLLER SAS/SATA","12GB/S /6GB/S 8i NO CACHE"," ",null,null,null,null,null,null,null,null,null,null,null,null,null,null,null,null,null,null,null,null,null,{"$f":"Tabelle212[[#This Row],[Menge\n    *)]]*5","v":0},null,null,null,{"$f":"Tabelle212[[#This Row],[Menge\n    *)]]*-1","v":0},{"$f":"Tabelle212[[#This Row],[Menge\n    *)]]*-1","v":0},{"$f":"Tabelle212[[#This Row],[Menge\n    *)]]*-1","v":0}]
[null,null,null,null,"653G7001",0,"GRAFENTHAL MEGARAID CACHECADE PRO 2.0","PHYSICAL KEY SSD CACHE ENABLER"," ",null,null,null,null,null,null,null,null,null,null,null,null,null,null,null,null,null,null,null,null,null,null,{"$f":"Tabelle212[[#This Row],[Menge\n    *)]]*-1","v":0}]
[null,null,null,null,"653G5903",0,"GRAFENTHAL CACHEVAULT FLASH CACHE","PROTECTION MODULE FOR RAID CTR"," ",null,null,null,null,null,null,null,null,null,null,null,null,null,null,null,null,null,null,null,null,null,null,null,null,{"$f":"Tabelle212[[#This Row],[Menge\n    *)]]*-1","v":0}]
[null,null,null,null,"HDD",{"$f":"SUM(F41:F42)","v":0}]
[null,null,null,null,"SATA SSD 6GB/s *MIDRANGE*",{"$f":"SUM(F41:F42)","v":0}]
[null,null,null,null,"651G7011",0,"GRAFENTHAL SSD 240GB 2.5'' SATA 6GB/S","MIDRANGE 599 TBW"," ",null,null,null,null,null,null,null,null,null,null,null,null,{"$f":"Tabelle212[[#This Row],[Menge\n    *)]]*-1","v":0},null,null,{"$f":"Tabelle212[[#This Row],[Menge\n    *)]]*-1","v":0}]
[null,null,null,null,"651G7012",0,"GRAFENTHAL SSD 480GB 2.5'' SATA 6GB/S","MIDRANGE 945 TBW"," ",null,null,null,null,null,null,null,null,null,null,null,null,{"$f":"Tabelle212[[#This Row],[Menge\n    *)]]*-1","v":0},null,null,{"$f":"Tabelle212[[#This Row],[Menge\n    *)]]*-1","v":0}]
[null,null,null,null,"SATA SSD 6GB/s *ENTRY*",{"$f":"SUM(F44:F47)","v":0},{"$error":"#N/A"}]
[null,null,null,null,"651G8024",0,"GRAFENTHAL SSD 256GB SATA3 6GB/S 2.5''","MTBF 1.5M HOURS TBW 300TB"," ",null,null,null,null,null,null,null,null,null,null,null,null,{"$f":"Tabelle212[[#This Row],[Menge\n    *)]]*-1","v":0},null,null,{"$f":"Tabelle212[[#This Row],[Menge\n    *)]]*-1","v":0}]
[null,null,null,null,"651G8025",0,"GRAFENTHAL SSD 512GB SATA3 6GB/S 2.5''","MTBF 1.5M HOURS TBW 300TB"," ",null,null,null,null,null,null,null,null,null,null,null,null,{"$f":"Tabelle212[[#This Row],[Menge\n    *)]]*-1","v":0},null,null,{"$f":"Tabelle212[[#This Row],[Menge\n    *)]]*-1","v":0}]
[null,null,null,null,"651G8026",0,"GRAFENTHAL SSD 1TB SATA3 6GB/S 2.5''","MTBF 1.5M HOURS TBW 300TB"," ",null,null,null,null,null,null,null,null,null,null,null,null,{"$f":"Tabelle212[[#This Row],[Menge\n    *)]]*-1","v":0},null,null,{"$f":"Tabelle212[[#This Row],[Menge\n    *)]]*-1","v":0}]
[null,null,null,null,"651G8027",0,"GRAFENTHAL SSD 2TB SATA3 6GB/S 2.5''","MTBF 1.5M HOURS TBW 300TB"," ",null,null,null,null,null,null,null,null,null,null,null,null,{"$f":"Tabelle212[[#This Row],[Menge\n    *)]]*-1","v":0},null,null,{"$f":"Tabelle212[[#This Row],[Menge\n    *)]]*-1","v":0}]
[null,null,null,null,"SATA HDD 6GB/s",{"$f":"SUM(F49)","v":0}]
[null,null,null,null,"651G6002",0,"GRAFENTHAL HDD 1TB 2,5'' SATA 7200RPM","32MB CACHE 6GB/S BAUHÖHE 9.5MM","FUER SERVER UND WORKSTATION",null,null,null,{"$f":"Tabelle212[[#This Row],[Menge\n    *)]]*-1","v":0},null,null,null,null,null,null,null,null,{"$f":"Tabelle212[[#This Row],[Menge\n    *)]]*-1","v":0},null,null,{"$f":"Tabelle212[[#This Row],[Menge\n    *)]]*-1","v":0}]
[null,null,null,null,"SATA 3,5 HDD 6GB/s",{"$f":"SUM(F51)","v":0}]
[null,null,null,null,"651G8012",0,"GRAFENTHAL HDD 12TB SATA 3.5'' 7.2K","6GB/S MTBF 2.5M HOURS 5Y WARRANTY"," ",null,null,null,null,null,null,null,null,null,null,null,null,{"$f":"Tabelle212[[#This Row],[Menge\n    *)]]*-1","v":0},null,null,null,{"$f":"Tabelle212[[#This Row],[Menge\n    *)]]*-1","v":0}]
[null,null,null,null,"651G8013",0,"GRAFENTHAL HDD 10TB SATA 3.5''","7.2K 6GB/S MTBF 2.5M HOURS 5Y WARRANTY"," ",null,null,null,null,null,null,null,null,null,null,null,null,{"$f":"Tabelle212[[#This Row],[Menge\n    *)]]*-1","v":0},null,null,null,{"$f":"Tabelle212[[#This Row],[Menge\n    *)]]*-1","v":0}]
[null,null,null,null,"651G8014",0,"GRAFENTHAL HDD 8TB SATA 3.5''","7.2K 6GB/S MTBF 2.5M HOURS 5Y WARRANTY"," ",null,null,null,null,null,null,null,null,null,null,null,null,{"$f":"Tabelle212[[#This Row],[Menge\n    *)]]*-1","v":0},null,null,null,{"$f":"Tabelle212[[#This Row],[Menge\n    *)]]*-1","v":0}]
[null,null,null,null,"651G8015",0,"GRAFENTHAL HDD 6TB SATA 3.5''","7.2K 6GB/S MTBF 2.5M HOURS 5Y WARRANTY"," ",null,null,null,null,null,null,null,null,null,null,null,null,{"$f":"Tabelle212[[#This Row],[Menge\n    *)]]*-1","v":0},null,null,null,{"$f":"Tabelle212[[#This Row],[Menge\n    *)]]*-1","v":0}]
[null,null,null,null,"651G8016",0,"GRAFENTHAL HDD 4TB SATA 3.5''","7.2K 6GB/S MTBF 2.5M HOURS 5Y WARRANTY"," ",null,null,null,null,null,null,null,null,null,null,null,null,{"$f":"Tabelle212[[#This Row],[Menge\n    *)]]*-1","v":0},null,null,null,{"$f":"Tabelle212[[#This Row],[Menge\n    *)]]*-1","v":0}]
[null,null,null,null,"651G8017",0,"GRAFENTHAL HDD 2TB SATA 3.5''","7.2K 6GB/S MTBF 2.5M HOURS 5Y WARRANTY"," ",null,null,null,null,null,null,null,null,null,null,null,null,{"$f":"Tabelle212[[#This Row],[Menge\n    *)]]*-1","v":0},null,null,null,{"$f":"Tabelle212[[#This Row],[Menge\n    *)]]*-1","v":0}]
[null,null,null,null,"651G8018",0,"GRAFENTHAL HDD 1TB SATA 3.5''","7.2K 6GB/S MTBF 2.5M HOURS 5Y WARRANTY"," ",null,null,null,null,null,null,null,null,null,null,null,null,{"$f":"Tabelle212[[#This Row],[Menge\n    *)]]*-1","v":0},null,null,null,{"$f":"Tabelle212[[#This Row],[Menge\n    *)]]*-1","v":0}]
[null,null,null,null,"SAS 3,5 HDD 6GB/s",{"$f":"SUM(F59:F63)","v":0}]
[null,null,null,null,"651G6019",0,"HDD 6TB SAS 7,2K 3,5“ 12GB/S 24/7","FOR GRAFENTHAL SERVER","MTTF 2.5M HOURS",null,null,null,null,null,null,null,null,null,null,null,null,{"$f":"Tabelle212[[#This Row],[Menge\n    *)]]*-1","v":0},null,null,null,{"$f":"Tabelle212[[#This Row],[Menge\n    *)]]*-1","v":0},null,null,null,null,{"$f":"Tabelle212[[#This Row],[Menge\n    *)]]*-1","v":0}]
[null,null,null,null,"651G6020",0,"GRAFENTHAL HDD 4TB SAS 7,2K 3,5“ 12GB/S","24/7","MTTF 2.5M HOURS",null,null,null,null,null,null,null,null,null,null,null,null,{"$f":"Tabelle212[[#This Row],[Menge\n    *)]]*-1","v":0},null,null,null,{"$f":"Tabelle212[[#This Row],[Menge\n    *)]]*-1","v":0},null,null,null,null,{"$f":"Tabelle212[[#This Row],[Menge\n    *)]]*-1","v":0}]
[null,null,null,null,"651G6021",0,"HDD 2TB SAS 7,2K 3,5“ 12GB/S 24/7","FOR GRAFENTHAL SERVER","MTTF 2.5M HOURS",null,null,null,null,null,null,null,null,null,null,null,null,{"$f":"Tabelle212[[#This Row],[Menge\n    *)]]*-1","v":0},null,null,null,{"$f":"Tabelle212[[#This Row],[Menge\n    *)]]*-1","v":0},null,null,null,null,{"$f":"Tabelle212[[#This Row],[Menge\n    *)]]*-1","v":0}]
[null,null,null,null,"651G6018",0,"HDD 8TB SAS 7,2K 3,5“ 12GB/S 24/7","FOR GRAFENTHAL SERVER","MTTF 2.5M HOURS",null,null,null,null,null,null,null,null,null,null,null,null,{"$f":"Tabelle212[[#This Row],[Menge\n    *)]]*-1","v":0},null,null,null,{"$f":"Tabelle212[[#This Row],[Menge\n    *)]]*-1","v":0},null,null,null,null,{"$f":"Tabelle212[[#This Row],[Menge\n    *)]]*-1","v":0}]
[null,null,null,null,"651G6016",0,"HDD 10TB SAS 7,2K 3,5“ 12GB/S 24/7","FOR GRAFENTHAL SERVER","MTTF 2.5M HOURS",null,null,null,null,null,null,null,null,null,null,null,null,{"$f":"Tabelle212[[#This Row],[Menge\n    *)]]*-1","v":0},null,null,null,{"$f":"Tabelle212[[#This Row],[Menge\n    *)]]*-1","v":0},null,null,null,null,{"$f":"Tabelle212[[#This Row],[Menge\n    *)]]*-1","v":0}]
[null,null,null,null,"SAS 2,5\" 10k 12GB/s",{"$f":"SUM(F65:F70)","v":0}]
[null,null,null,null,"651G8020",0,"GRAFENTHAL HDD 300GB 10K 2.5'' SAS","12GB/S"," ",null,null,null,{"$f":"Tabelle212[[#This Row],[Menge\n    *)]]*-1","v":0},null,null,null,null,null,null,null,null,{"$f":"Tabelle212[[#This Row],[Menge\n    *)]]*-1","v":0},null,null,{"$f":"Tabelle212[[#This Row],[Menge\n    *)]]*-1","v":0},null,null,null,null,null,{"$f":"Tabelle212[[#This Row],[Menge\n    *)]]*-1","v":0}]
[null,null,null,null,"651G8005",0,"GRAFENTHAL HDD 600GB 10K 2.5\\ SAS 12GB/S\""," "," ",null,null,null,{"$f":"Tabelle212[[#This Row],[Menge\n    *)]]*-1","v":0},null,null,null,null,null,null,null,null,{"$f":"Tabelle212[[#This Row],[Menge\n    *)]]*-1","v":0},null,null,{"$f":"Tabelle212[[#This Row],[Menge\n    *)]]*-1","v":0},null,null,null,null,null,{"$f":"Tabelle212[[#This Row],[Menge\n    *)]]*-1","v":0}]
[null,null,null,null,"651G8006",0,"GRAFENTHAL HDD 900GB 10K 2.5\\ SAS 12GB/S\""," "," ",null,null,null,{"$f":"Tabelle212[[#This Row],[Menge\n    *)]]*-1","v":0},null,null,null,null,null,null,null,null,{"$f":"Tabelle212[[#This Row],[Menge\n    *)]]*-1","v":0},null,null,{"$f":"Tabelle212[[#This Row],[Menge\n    *)]]*-1","v":0},null,null,null,null,null,{"$f":"Tabelle212[[#This Row],[Menge\n    *)]]*-1","v":0}]
[null,null,null,null,"651G8007",0,"GRAFENTHAL HDD 1.2TB 10K 2.5\\ SAS 12GB/S\""," "," ",null,null,null,{"$f":"Tabelle212[[#This Row],[Menge\n    *)]]*-1","v":0},null,null,null,null,null,null,null,null,{"$f":"Tabelle212[[#This Row],[Menge\n    *)]]*-1","v":0},null,null,{"$f":"Tabelle212[[#This Row],[Menge\n    *)]]*-1","v":0},null,null,null,null,null,{"$f":"Tabelle212[[#This Row],[Menge\n    *)]]*-1","v":0}]
[null,null,null,null,"651G8021",0,"GRAFENTHAL HDD 1.8TB 10K 2.5'' SAS","12GB/S"," ",null,null,null,{"$f":"Tabelle212[[#This Row],[Menge\n    *)]]*-1","v":0},null,null,null,null,null,null,null,null,{"$f":"Tabelle212[[#This Row],[Menge\n    *)]]*-1","v":0},null,null,{"$f":"Tabelle212[[#This Row],[Menge\n    *)]]*-1","v":0},null,null,null,null,null,{"$f":"Tabelle212[[#This Row],[Menge\n    *)]]*-1","v":0}]
[null,null,null,null,"651G8022",0,"GRAFENTHAL HDD 2.4TB 10K 2.5'' SAS","12GB/S"," ",null,null,null,{"$f":"Tabelle212[[#This Row],[Menge\n    *)]]*-1","v":0},null,null,null,null,null,null,null,null,{"$f":"Tabelle212[[#This Row],[Menge\n    *)]]*-1","v":0},null,null,{"$f":"Tabelle212[[#This Row],[Menge\n    *)]]*-1","v":0},null,null,null,null,null,{"$f":"Tabelle212[[#This Row],[Menge\n    *)]]*-1","v":0}]
[null,null,null,null,"SAS 2,5\" 15k 12GB/s",{"$f":"SUM(F72:F74)","v":0}]
[null,null,null,null,"651G8003",0,"GRAFENTHAL HDD 300GB 15K 2.5\\ SAS 12GB/S\""," "," ",null,null,null,{"$f":"Tabelle212[[#This Row],[Menge\n    *)]]*-1","v":0},null,null,null,null,null,null,null,null,{"$f":"Tabelle212[[#This Row],[Menge\n    *)]]*-1","v":0},null,null,{"$f":"Tabelle212[[#This Row],[Menge\n    *)]]*-1","v":0},null,null,null,null,null,{"$f":"Tabelle212[[#This Row],[Menge\n    *)]]*-1","v":0}]
[null,null,null,null,"651G8004",0,"GRAFENTHAL HDD 600GB 15K 2.5\\ SAS 12GB/S\""," "," ",null,null,null,{"$f":"Tabelle212[[#This Row],[Menge\n    *)]]*-1","v":0},null,null,null,null,null,null,null,null,{"$f":"Tabelle212[[#This Row],[Menge\n    *)]]*-1","v":0},null,null,{"$f":"Tabelle212[[#This Row],[Menge\n    *)]]*-1","v":0},null,null,null,null,null,{"$f":"Tabelle212[[#This Row],[Menge\n    *)]]*-1","v":0}]
[null,null,null,null,"651G8019",0,"GRAFENTHAL HDD 900GB 15K 2.5'' SAS","12GB/S"," ",null,null,null,{"$f":"Tabelle212[[#This Row],[Menge\n    *)]]*-1","v":0},null,null,null,null,null,null,null,null,{"$f":"Tabelle212[[#This Row],[Menge\n    *)]]*-1","v":0},null,null,{"$f":"Tabelle212[[#This Row],[Menge\n    *)]]*-1","v":0},null,null,null,null,null,{"$f":"Tabelle212[[#This Row],[Menge\n    *)]]*-1","v":0}]
[null,null,null,null,"SAS SSD  12GB/s *midrange*",{"$f":"SUM(F76:F79)","v":0}]
[null,null,null,null,"651G7004",0,"GRAFENTHAL SSD 480GB 2,5'' SAS 12GB/S","MIDRANGE DWPD 1"," ",null,null,null,null,null,null,null,null,null,null,null,null,{"$f":"Tabelle212[[#This Row],[Menge\n    *)]]*-1","v":0},null,null,{"$f":"Tabelle212[[#This Row],[Menge\n    *)]]*-1","v":0},null,null,null,null,null,{"$f":"Tabelle212[[#This Row],[Menge\n    *)]]*-1","v":0}]
[null,null,null,null,"651G7005",0,"GRAFENTHAL SSD 960GB 2,5'' SAS 12GB/S","MIDRANGE DWPD 1"," ",null,null,null,null,null,null,null,null,null,null,null,null,{"$f":"Tabelle212[[#This Row],[Menge\n    *)]]*-1","v":0},null,null,{"$f":"Tabelle212[[#This Row],[Menge\n    *)]]*-1","v":0},null,null,null,null,null,{"$f":"Tabelle212[[#This Row],[Menge\n    *)]]*-1","v":0}]
[null,null,null,null,"651G7006",0,"GRAFENTHAL SSD 1920GB 2,5'' SAS 12GB/S","MIDRANGE DWPD 1"," ",null,null,null,null,null,null,null,null,null,null,null,null,{"$f":"Tabelle212[[#This Row],[Menge\n    *)]]*-1","v":0},null,null,{"$f":"Tabelle212[[#This Row],[Menge\n    *)]]*-1","v":0},null,null,null,null,null,{"$f":"Tabelle212[[#This Row],[Menge\n    *)]]*-1","v":0}]
[null,null,null,null,"651G7007",0,"GRAFENTHAL SSD 3840GB 2,5'' SAS 12GB/S","MIDRANGE DWPD 1"," ",null,null,null,null,null,null,null,null,null,null,null,null,{"$f":"Tabelle212[[#This Row],[Menge\n    *)]]*-1","v":0},null,null,{"$f":"Tabelle212[[#This Row],[Menge\n    *)]]*-1","v":0},null,null,null,null,null,{"$f":"Tabelle212[[#This Row],[Menge\n    *)]]*-1","v":0}]
[null,null,null,null,"SSD M.2 NVMe",{"$f":"SUM(F81:F83)","v":0},""]
[null,null,null,null,"651G7000",0,"GRAFENTHAL SSD 512GB NVME M.2","PCIe 3.0 x4 READ 3500MB/S WRITE 2100MB/S"," ",null,null,null,null,null,null,null,null,null,null,null,null,{"$f":"Tabelle212[[#This Row],[Menge\n    *)]]*-1","v":0},null,null,null,null,null,null,null,null,null,null,null,null,null,null,null,null,{"$f":"Tabelle212[[#This Row],[Menge\n    *)]]*-1","v":0}]
[null,null,null,null,"651G7001",0,"GRAFENTHAL SSD 1TB NVME M.2","PCIe 3.0 x4 READ 3500MB/S WRITE 2100MB/S"," ",null,null,null,null,null,null,null,null,null,null,null,null,{"$f":"Tabelle212[[#This Row],[Menge\n    *)]]*-1","v":0},null,null,null,null,null,null,null,null,null,null,null,null,null,null,null,null,{"$f":"Tabelle212[[#This Row],[Menge\n    *)]]*-1","v":0}]
[null,null,null,null,"651G7002",0,"GRAFENTHAL SSD 2TB NVME M.2","PCIe 3.0 x4 READ 3500MB/S WRITE 2100MB/S"," ",null,null,null,null,null,null,null,null,null,null,null,null,{"$f":"Tabelle212[[#This Row],[Menge\n    *)]]*-1","v":0},null,null,null,null,null,null,null,null,null,null,null,null,null,null,null,null,{"$f":"Tabelle212[[#This Row],[Menge\n    *)]]*-1","v":0}]
[null,null,null,null,"SSD M.2 SATA",{"$f":"SUM(F85:F87)","v":0},""]
[null,null,null,null,"651G8000",0,"GRAFENTHAL SSD 256GB M.2 2280 SATA 6GB/S","256BIT-AES MTBF 1.6M HOURS TBW 144TB"," ",null,null,null,null,null,null,null,null,null,null,null,null,{"$f":"Tabelle212[[#This Row],[Menge\n    *)]]*-1","v":0},null,null,null,null,null,null,null,null,null,null,null,null,null,null,null,null,{"$f":"Tabelle212[[#This Row],[Menge\n    *)]]*-1","v":0}]
[null,null,null,null,"651G8001",0,"GRAFENTHAL SSD 512GB M.2 2280 SATA 6GB/S","256BIT-AES MTBF 1.6M HOURS TBW 288TB"," ",null,null,null,null,null,null,null,null,null,null,null,null,{"$f":"Tabelle212[[#This Row],[Menge\n    *)]]*-1","v":0},null,null,null,null,null,null,null,null,null,null,null,null,null,null,null,null,{"$f":"Tabelle212[[#This Row],[Menge\n    *)]]*-1","v":0}]
[null,null,null,null,"651G8002",0,"GRAFENTHAL SSD 1TB M.2 2280 SATA 6GB/S","256BIT-AES TCG OPAL 2.0 MTBF 1.5M HOURS"," ",null,null,null,null,null,null,null,null,null,null,null,null,{"$f":"Tabelle212[[#This Row],[Menge\n    *)]]*-1","v":0},null,null,null,null,null,null,null,null,null,null,null,null,null,null,null,null,{"$f":"Tabelle212[[#This Row],[Menge\n    *)]]*-1","v":0}]
[null,null,null,null,"HBA SAS",{"$f":"SUM(F89)","v":0}]
[null,null,null,null,"653G6005",0,"GRAFENTHAL HBA SAS/SATA 12Gb/s 9300-4i4e"," "," ",null,null,null,null,null,null,null,null,null,null,null,null,null,null,null,null,null,null,null,null,null,null,null,null,null,{"$f":"Tabelle212[[#This Row],[Menge\n    *)]]*-1","v":0},{"$f":"Tabelle212[[#This Row],[Menge\n    *)]]*-1","v":0},{"$f":"Tabelle212[[#This Row],[Menge\n    *)]]*-1","v":0}]
[null,null,null,null,"653G7005",0,"GRAFENTHAL CONTROLLER HBA SAS 9300-8E","8 PORT EXTERN MULTI LANE PCI LP BROADCOM"," ",null,null,null,null,null,null,null,null,null,null,null,null,null,null,null,null,null,null,null,null,null,null,null,null,null,{"$f":"Tabelle212[[#This Row],[Menge\n    *)]]*-1","v":0},{"$f":"Tabelle212[[#This Row],[Menge\n    *)]]*-1","v":0},{"$f":"Tabelle212[[#This Row],[Menge\n    *)]]*-1","v":0}]
[null,null,null,null,"653G7006",0,"GRAFENTHAL EXTERNAL SAS CABLE 2M","SFF-8644 TO SFF-8644"," "]
[null,null,null,null,"653G7007",0,"GRAFENTHAL EXTERNAL SAS CABLE 1M","SFF-8644 TO SFF-8644"," "]
[null,null,null,null,"(Kupfer-) Netzkarte",{"$f":"SUM(F94:F95)","v":0}]
[null,null,null,null,"653G7002",0,"GRAFENTHAL ETHERNET ADAPTER DUAL PORT","RJ45 2x10GBE X550-T2 PCIe 3.0 x4"," ",null,null,null,null,null,null,null,null,null,null,null,null,null,null,null,null,null,null,null,null,null,null,null,null,null,{"$f":"Tabelle212[[#This Row],[Menge\n    *)]]*-1","v":0},{"$f":"Tabelle212[[#This Row],[Menge\n    *)]]*-1","v":0},{"$f":"Tabelle212[[#This Row],[Menge\n    *)]]*-1","v":0}]
[null,null,null,null,"659G8015",0,"GRAFENTHAL GIGABIT ETHERNET APDATER","I350-T4V2 4x RJ-45 PCIe x4 COPPER"," ",null,null,null,null,null,null,null,null,null,null,null,null,null,null,null,null,null,null,null,null,null,null,null,null,null,{"$f":"Tabelle212[[#This Row],[Menge\n    *)]]*-1","v":0},{"$f":"Tabelle212[[#This Row],[Menge\n    *)]]*-1","v":0}]
[null,null,null,null,"(SFP+)Netzwerkkarte",{"$f":"SUM(F97)","v":0}]
[null,null,null,null,"653G7003",0,"GRAFENTHAL ETHERNET ADAPTER 2-PORT 10GBE","INTEL X520 FIBRE SFP+ PCIe x8 LP"," "]
[null,null,null,null,"Glasfaserkarten",{"$f":"SUM(F99:F100)","v":0}]
[null,null,null,null,"659G7000",0,"GRAFENTHAL QLOGIC HBA FC SINGLE PORT","16GB/S PCIe 3.0 x8"," ",null,null,null,null,null,null,null,null,null,null,null,null,null,null,null,null,null,null,null,null,null,null,null,null,null,{"$f":"Tabelle212[[#This Row],[Menge\n    *)]]*-1","v":0},{"$f":"Tabelle212[[#This Row],[Menge\n    *)]]*-1","v":0},{"$f":"Tabelle212[[#This Row],[Menge\n    *)]]*-1","v":0}]
[null,null,null,null,"659G7001",0,"GRAFENTHAL QLOGIC HBA FC DUAL PORT","16GB/S PCIe 3.0 x8"," ",null,null,null,null,null,null,null,null,null,null,null,null,null,null,null,null,null,null,null,null,null,null,null,null,null,{"$f":"Tabelle212[[#This Row],[Menge\n    *)]]*-1","v":0},{"$f":"Tabelle212[[#This Row],[Menge\n    *)]]*-1","v":0},{"$f":"Tabelle212[[#This Row],[Menge\n    *)]]*-1","v":0}]
[null,null,null,null,"KVM Upgrade",{"$f":"SUM(F102)","v":0}]
[null,null,null,null,"653G6006",0,"GRAFENTHAL KVM UPGRADE CHIP","FOR R1104 S2"," "]
[null,null,null,null,"Betriebssysteme",{"$f":"SUM(F104:F105)","v":0}]
[null,null,null,null,"655G3002",0,"GRAFENTHAL WINDOWS SERVER 2012 R2","ESSENTIALS LIZENZ UND MEDIEN 1-2 CPU"," "]
[null,null,null,null,"655G3003",0,"GRAFENTHAL WINDOWS SERVER 2012 R2","STANDARD LIZENZ UND MEDIEN 2 CPU"," "]
[null,null,null,null,"P73-07115",0,"MICROSOFT WINDOWS SERVER 2016 STANDARD","64BIT 16C"," "]
[null,null,null,null,"MPAC",5]
[null,null,null,null,"740M6228",0,"GRAFENTHAL MPAC VOR ORT SERVICE UPGRADE","3 JAHRE 13x5 24STUNDEN WIEDERHERSTELLUNG","FÜR GRAFENTHAL R1104 S2"]
[null,null,null,null,"740M6229",0,"GRAFENTHAL MPAC VOR ORT SERVICE UPGRADE","3 JAHRE 13x5 12STUNDEN WIEDERHERSTELLUNG","FÜR GRAFENTHAL R1104 S2"]
[null,null,null,null,"740M6230",0,"GRAFENTHAL MPAC VOR ORT SERVICE UPGRADE","3 JAHRE 24x7 6 STUNDEN WIEDERHERSTELLUNG","FÜR GRAFENTHAL R1104 S2"]
[null,null,null,null,"740M6231",0,"GRAFENTHAL MPAC VOR ORT SERVICE UPGRADE","4 JAHRE 13x5 24STUNDEN WIEDERHERSTELLUNG","FÜR GRAFENTHAL R1104 S2"]
[null,null,null,null,"740M6232",0,"GRAFENTHAL MPAC VOR ORT SERVICE UPGRADE","4 JAHRE 13x5 12STUNDEN WIEDERHERSTELLUNG","FÜR GRAFENTHAL R1104 S2"]
[null,null,null,null,"740M6233",0,"GRAFENTHAL MPAC VOR ORT SERVICE UPGRADE","4 JAHRE 24x7 6 STUNDEN WIEDERHERSTELLUNG","FÜR GRAFENTHAL R1104 S2"]
[null,null,null,null,"740M6234",0,"GRAFENTHAL MPAC VOR ORT SERVICE UPGRADE","5 JAHRE 13x5 24STUNDEN WIEDERHERSTELLUNG","FÜR GRAFENTHAL R1104 S2"]
[null,null,null,null,"740M6235",0,"GRAFENTHAL MPAC VOR ORT SERVICE UPGRADE","5 JAHRE 13x5 12STUNDEN WIEDERHERSTELLUNG","FÜR GRAFENTHAL R1104 S2"]
[null,null,null,null,"740M6236",0,"GRAFENTHAL MPAC VOR ORT SERVICE UPGRADE","5 JAHRE 24x7 6 STUNDEN WIEDERHERSTELLUNG","FÜR GRAFENTHAL R1104 S2"]
[null,null,null,null,"740M6237",0,"GRAFENTHAL MPAC VOR ORT SERVICE UPGRADE","3 JAHRE 13x5 24STD WIEDERHERSTELLUNG DMR","FÜR GRAFENTHAL R1104 S2"]
[null,null,null,null,"740M6238",0,"GRAFENTHAL MPAC VOR ORT SERVICE UPGRADE","3 JAHRE 13x5 12STD WIEDERHERSTELLUNG DMR","FÜR GRAFENTHAL R1104 S2"]
[null,null,null,null,"740M6239",0,"GRAFENTHAL MPAC VOR ORT SERVICE UPGRADE","3 JAHRE 24x7 6STD WIEDERHERSTELLUNG DMR","FÜR GRAFENTHAL R1104 S2"]
[null,null,null,null,"740M6240",0,"GRAFENTHAL MPAC VOR ORT SERVICE UPGRADE","4 JAHRE 13x5 24STD WIEDERHERSTELLUNG DMR","FÜR GRAFENTHAL R1104 S2"]
[null,null,null,null,"740M6241",0,"GRAFENTHAL MPAC VOR ORT SERVICE UPGRADE","4 JAHRE 13x5 12STD WIEDERHERSTELLUNG DMR","FÜR GRAFENTHAL R1104 S2"]
[null,null,null,null,"740M6242",0,"GRAFENTHAL MPAC VOR ORT SERVICE UPGRADE","4 JAHRE 24x7 6STD WIEDERHERSTELLUNG DMR","FÜR GRAFENTHAL R1104 S2"]
[null,null,null,null,"740M6243",0,"GRAFENTHAL MPAC VOR ORT SERVICE UPGRADE","5 JAHRE 13x5 24STD WIEDERHERSTELLUNG DMR","FÜR GRAFENTHAL R1104 S2"]
[null,null,null,null,"740M6244",0,"GRAFENTHAL MPAC VOR ORT SERVICE UPGRADE","5 JAHRE 13x5 12STD WIEDERHERSTELLUNG DMR","FÜR GRAFENTHAL R1104 S2"]
[null,null,null,null,"740M6245",0,"GRAFENTHAL MPAC VOR ORT SERVICE UPGRADE","5 JAHRE 24x7 6STD WIEDERHERSTELLUNG DMR","FÜR GRAFENTHAL R1104 S2"]
[null,null,null,null,"CONFIG-TO-ORDER",{"$f":"SUM(F127:F130)","v":0}]
[null,null,null,null,"CTO",0,"HARDWARE ASSEMBLIERUNG"]
[null,null,null,null,"CTO1",0,"HARDWARE ASSEMBLIERUNG & FIRMWARE UPDATE"]
[null,null,null,null,"CTO2",0,"HARDWARE ASSEMBLIERUNG, FIRMWARE UPDATE & RAID EINRICHTUNG"]
[null,null,null,null,"CTO3",0,"HARDWARE ASSEMBLIERUNG, FIRMWARE UPDATE, RAID EINRICHTUNG & OS INSTALLATION"]
[null,null,null,null,"USB Drive",{"$f":"SUM(F132)","v":0}]
[null,null,null,null,"652G6004",0,"GRAFENTHAL USB 3.0 FLASH DRIVE","ULTRA FIT 64GB UP TO 150MB/S"," "]
[null,null,null,null,"USV- Systeme",{"$f":"SUM(F134:F137)","v":0}]
[null,null,null,null,"132G0150",0,"GRAFENTHAL USV ETR-1500 TOWER RACK LINE","INTERACTIVE 1500VA 1200W PURE SINEWAVE","ECO MODE 23KG CE ROHS GERMAN"]
[null,null,null,null,"132G0300",0,"GRAFENTHAL USV ETR-3000 TOWER RACK LINE","INTERACTIVE 3000VA 2400W PURE SINEWAVE","ECO MODE 35KG CE ROHS GERMAN"]
[null,null,null,null,"113G1150",0,"GRAFENTHAL USV PR-1500-HS PROGRAMMABLE","ECO MODE RACK MOUNT 2U USB RS232 LCD"," "]
[null,null,null,null,"113G1300",0,"GRAFENTHAL USV PR-3000-HS ONLINE","ECO MODE RACK MOUNT 2U USB RS232 LCD"," "]
[null,null,null,null,"USV- Zubehör",{"$f":"SUM(F139:F140)","v":0}]
[null,null,null,null,"149G6005",0,"GRAFENTHAL USV SNMP CARD PRO S2","FOR ETR AND PR AND PTR SERIES","MULTI SERVER SHUTDOWN"]
[null,null,null,null,"149G5003",0,"GRAFENTHAL USV ACCESSORY LICENSE FOR","SNMP PRO CARD FOR ETR AND PR SERIES","MULTI SERVER SHUTDOWN"]
[null,null,null,null,"SUMME",1,null,null,null,{"$f":"COUNTIF($J$142:$AN$142,\"<0\")","v":0}]
[null,null,null,null,null,null,null,null,null,{"$f":"SUM(J14:J140)","v":0},0,0,0,0,0,0,0,0,0,0,0,0,0,0,0,0,0,0,0,0,0,0,0,0,0,0,0,0,0,0]

{"sheet":"R1104 S2 NAS","index":6,"n_rows":94,"n_cols":40,"rows_kept":94,"cut":false,"hidden":false,"merged":[[0,4,0,8]]}
[null,null,null,null,"1U NAS R1104 S2"]
[]
[null,null,null,null,null,null,null,"Intel Xeon Prozessor E3-1200 v5 Architektur","more Info"]
[null,null,null,null,null,null,null,"zwei M.2 Storage Ports (2280/2260/2242)"]
[null,null,null,null,null,null,null,"bis zu 40 TB Storage auf einer Höheneinheit"]
[null,null,null,null,null,null,null,"Intel Rapid Storage Technologie Software RAID 0, 1, 5, 10"]
[null,null,null,null,null,null,null,"Redundante Netzteile (modellabhängig)","* Felder werden automatisch ausgefüllt"]
[null,null,null,null,null,null,null,null,"*) \"Menge\" filtern um Konfiguration anzuzeigen"]
[]
[]
[null,null,null,null,"Konfigurator",null,{"$f":"'Revision Info'!B10","v":"Revision 15"}]
[null,null,null,null,"ART. NR.","Menge\n    *)","Bezeichnung","Bezeichnung II","Bezeichung III","nicht kombinierbar","nicht konfigurierbar","CPU SLOT","interner SSD Slot","Frei3","Frei4","Frei5","Frei6","Frei7","Frei8","Frei9","Frei10","SATA Ports","MEM Slots","SSD Slots","HDD Slots HS 2.5","HDD Slots HS 3.5","HDD Slots HS SAS","HDD Slots HS SATA","HDD Slots NHS SAS","HDD Slots NHS SATA","SAS Ports","CacheCade","3,5 Slots","Cachevault","PCI x1 Slots","PCI x4 Slots","PCI x8 Slots","PCI x16 Slots","M.2 Slot","Frei12"]
[null,null,null,null,"Maschinentyp",{"$f":"SUM(F14:F15)","v":0},null,null,null,"if (Kombi);-1;0","if Menge;-1;0","(Menge x Eigenschaft)","(Menge x Eigenschaft)","(Menge x Eigenschaft)","(Menge x Eigenschaft)","(Menge x Eigenschaft)","(Menge x Eigenschaft)","(Menge x Eigenschaft)","(Menge x Eigenschaft)","(Menge x Eigenschaft)","(Menge x Eigenschaft)","(Menge x Eigenschaft)","(Menge x Eigenschaft)","(Menge x Eigenschaft)","(Menge x Eigenschaft)","(Menge x Eigenschaft)","(Menge x Eigenschaft)","(Menge x Eigenschaft)","(Menge x Eigenschaft)","(Menge x Eigenschaft)","(Menge x Eigenschaft)","(Menge x Eigenschaft)","(Menge x Eigenschaft)","(Menge x Eigenschaft)","(Menge x Eigenschaft)","(Menge x Eigenschaft)","(Menge x Eigenschaft)","(Menge x Eigenschaft)","(Menge x Eigenschaft)","(Menge x Eigenschaft)"]
[null,null,null,null,"611G7000",0,"GRAFENTHAL CTO RACK SERVER 1U R1104 S2","INTEL E3-1200V5 SOCKET 4xMEM SLOTS","4x3,5\\ 2xM.2 4xGB LAN SINGLE PSU 400W\"",null,null,{"$f":"Tabelle2125[[#This Row],[Menge\n    *)]]*1","v":0},{"$f":"Tabelle2125[[#This Row],[Menge\n    *)]]*4","v":0},null,null,null,null,null,null,null,null,{"$f":"Tabelle2125[[#This Row],[Menge\n    *)]]*6","v":0},{"$f":"Tabelle2125[[#This Row],[Menge\n    *)]]*4","v":0},null,{"$f":"Tabelle2125[[#This Row],[Menge\n    *)]]*5","v":0},{"$f":"Tabelle2125[[#This Row],[Menge\n    *)]]*4","v":0},null,null,null,null,{"$f":"Tabelle2125[[#This Row],[Menge\n    *)]]*0","v":0},null,null,null,{"$f":"Tabelle2125[[#This Row],[Menge\n    *)]]*2","v":0},{"$f":"Tabelle2125[[#This Row],[Menge\n    *)]]*2","v":0},{"$f":"Tabelle2125[[#This Row],[Menge\n    *)]]*2","v":0},{"$f":"Tabelle2125[[#This Row],[Menge\n    *)]]*1","v":0},{"$f":"Tabelle2125[[#This Row],[Menge\n    *)]]*2","v":0}]
[null,null,null,null,"611G7002",0,"GRAFENTHAL CTO RACK SERVER 1U R1104 S2","INTEL E3-1200V5 SOCKET 4xMEM SLOTS","2xM.2  4xGIGABIT RED PSU 450W (2/2)",null,null,{"$f":"Tabelle2125[[#This Row],[Menge\n    *)]]*1","v":0},{"$f":"Tabelle2125[[#This Row],[Menge\n    *)]]*4","v":0},null,null,null,null,null,null,null,null,{"$f":"Tabelle2125[[#This Row],[Menge\n    *)]]*5","v":0},{"$f":"Tabelle2125[[#This Row],[Menge\n    *)]]*4","v":0},null,{"$f":"Tabelle2125[[#This Row],[Menge\n    *)]]*5","v":0},{"$f":"Tabelle2125[[#This Row],[Menge\n    *)]]*4","v":0},null,null,null,null,{"$f":"Tabelle2125[[#This Row],[Menge\n    *)]]*0","v":0},null,null,null,{"$f":"Tabelle2125[[#This Row],[Menge\n    *)]]*2","v":0},{"$f":"Tabelle2125[[#This Row],[Menge\n    *)]]*2","v":0},{"$f":"Tabelle2125[[#This Row],[Menge\n    *)]]*2","v":0},{"$f":"Tabelle2125[[#This Row],[Menge\n    *)]]*1","v":0},{"$f":"Tabelle2125[[#This Row],[Menge\n    *)]]*2","v":0}]
[null,null,null,null,"Prozessor",{"$f":"SUM(F17:F28)","v":0}," *mindestens 1 CPU benötigt*"]
[null,null,null,null,"656G8000",0,"GRAFENTHAL CPU XEON E3-1220v6 3.00GHz 4C","8MB 72W"," ",{"$f":"IF(COUNTIF(F17:F28,\">0\")>1,-1,0)","v":0},null,{"$f":"Tabelle2125[[#This Row],[Menge\n    *)]]*-1","v":0}]
[null,null,null,null,"656G8001",0,"GRAFENTHAL CPU XEON E3-1230v6 3.50GHz 4C","8MB 72W"," ",null,null,{"$f":"Tabelle2125[[#This Row],[Menge\n    *)]]*-1","v":0}]
[null,null,null,null,"656G8002",0,"GRAFENTHAL CPU XEON E3-1240v6 3.70GHz 4C","8MB 72W"," ",null,null,{"$f":"Tabelle2125[[#This Row],[Menge\n    *)]]*-1","v":0}]
[null,null,null,null,"656G8003",0,"GRAFENTHAL CPU XEON E3-1245v6 3.70GHz 4C","8MB 73W INTEL HD GRAPHICS P630"," ",null,null,{"$f":"Tabelle2125[[#This Row],[Menge\n    *)]]*-1","v":0}]
[null,null,null,null,"656G8004",0,"GRAFENTHAL CPU XEON E3-1270v6 3.80GHz 4C","8MB 72W"," ",null,null,{"$f":"Tabelle2125[[#This Row],[Menge\n    *)]]*-1","v":0}]
[null,null,null,null,"656G8005",0,"GRAFENTHAL CPU XEON E3-1275v6 3.80GHz 4C","8MB 73W INTEL HD GRAPHICS P630"," ",null,null,{"$f":"Tabelle2125[[#This Row],[Menge\n    *)]]*-1","v":0}]
[null,null,null,null,"656G8006",0,"GRAFENTHAL CPU XEON E3-1280v6 3.90GHz 4C","8MB 72W"," ",null,null,{"$f":"Tabelle2125[[#This Row],[Menge\n    *)]]*-1","v":0}]
[null,null,null,null,"656G8007",0,"GRAFENTHAL CPU CELERON G3930 2.90GHz 2C","2MB 51W INTEL HD GRAPHICS 610"," ",null,null,{"$f":"Tabelle2125[[#This Row],[Menge\n    *)]]*-1","v":0}]
[null,null,null,null,"656G8008",0,"GRAFENTHAL CPU CELERON G3950 3.00GHz 2C","2MB 51W INTEL HD GRAPHICS 610"," ",null,null,{"$f":"Tabelle2125[[#This Row],[Menge\n    *)]]*-1","v":0}]
[null,null,null,null,"656G8009",0,"GRAFENTHAL CPU PENTIUM G4560 3.50GHz 2C","3MB 54W INTEL HD GRAPHICS 610"," ",null,null,{"$f":"Tabelle2125[[#This Row],[Menge\n    *)]]*-1","v":0}]
[null,null,null,null,"656G8010",0,"GRAFENTHAL CPU PENTIUM G4600 3.60GHz 2C","3MB 51W INTEL HD GRAPHICS 630"," ",null,null,{"$f":"Tabelle2125[[#This Row],[Menge\n    *)]]*-1","v":0}]
[null,null,null,null,"656G8011",0,"GRAFENTHAL CPU PENTIUM G4620 3.70GHz 2C","3MB 51W INTEL HD GRAPHICS 630"," ",null,null,{"$f":"Tabelle2125[[#This Row],[Menge\n    *)]]*-1","v":0}]
[null,null,null,null,"Arbeitsspeicher",{"$f":"SUM(F30:F31)","v":0},""]
[null,null,null,null,"652G7004",0,"GRAFENTHAL MEM 8GB DDR4-2400MHz UDIMM","PC4-19200 CL17 DUAL RANKED ECC"," ",{"$f":"IF(COUNTIF(F30:F31,\">0\")>1,-1,0)","v":0},null,null,null,null,null,null,null,null,null,null,null,null,{"$f":"Tabelle2125[[#This Row],[Menge\n    *)]]*-1","v":0}]
[null,null,null,null,"652G7005",0,"GRAFENTHAL MEM 16GB DDR4-2400MHz UDIMM","PC4-19200 CL17 DUAL RANKED ECC"," ",null,null,null,null,null,null,null,null,null,null,null,null,null,{"$f":"Tabelle2125[[#This Row],[Menge\n    *)]]*-1","v":0}]
[null,null,null,null,"HDD",{"$f":"SUM(F34:F35)","v":0}]
[null,null,null,null,"SATA SSD 6GB/s *MIDRANGE*",{"$f":"SUM(F34:F35)","v":0}]
[null,null,null,null,"651G7011",0,"GRAFENTHAL SSD 240GB 2.5'' SATA 6GB/S","MIDRANGE 599 TBW"," ",null,null,null,null,null,null,null,null,null,null,null,null,{"$f":"Tabelle2125[[#This Row],[Menge\n    *)]]*-1","v":0},null,null,{"$f":"Tabelle2125[[#This Row],[Menge\n    *)]]*-1","v":0}]
[null,null,null,null,"651G7012",0,"GRAFENTHAL SSD 480GB 2.5'' SATA 6GB/S","MIDRANGE 945 TBW"," ",null,null,null,null,null,null,null,null,null,null,null,null,{"$f":"Tabelle2125[[#This Row],[Menge\n    *)]]*-1","v":0},null,null,{"$f":"Tabelle2125[[#This Row],[Menge\n    *)]]*-1","v":0}]
[null,null,null,null,"SATA SSD 6GB/s *ENTRY*",{"$f":"SUM(F37:F40)","v":0},{"$error":"#N/A"}]
[null,null,null,null,"651G8024",0,"GRAFENTHAL SSD 256GB SATA3 6GB/S 2.5''","MTBF 1.5M HOURS TBW 300TB"," ",null,null,null,null,null,null,null,null,null,null,null,null,{"$f":"Tabelle2125[[#This Row],[Menge\n    *)]]*-1","v":0},null,null,{"$f":"Tabelle2125[[#This Row],[Menge\n    *)]]*-1","v":0}]
[null,null,null,null,"651G8025",0,"GRAFENTHAL SSD 512GB SATA3 6GB/S 2.5''","MTBF 1.5M HOURS TBW 300TB"," ",null,null,null,null,null,null,null,null,null,null,null,null,{"$f":"Tabelle2125[[#This Row],[Menge\n    *)]]*-1","v":0},null,null,{"$f":"Tabelle2125[[#This Row],[Menge\n    *)]]*-1","v":0}]
[null,null,null,null,"651G8026",0,"GRAFENTHAL SSD 1TB SATA3 6GB/S 2.5''","MTBF 1.5M HOURS TBW 300TB"," ",null,null,null,null,null,null,null,null,null,null,null,null,{"$f":"Tabelle2125[[#This Row],[Menge\n    *)]]*-1","v":0},null,null,{"$f":"Tabelle2125[[#This Row],[Menge\n    *)]]*-1","v":0}]
[null,null,null,null,"651G8027",0,"GRAFENTHAL SSD 2TB SATA3 6GB/S 2.5''","MTBF 1.5M HOURS TBW 300TB"," ",null,null,null,null,null,null,null,null,null,null,null,null,{"$f":"Tabelle2125[[#This Row],[Menge\n    *)]]*-1","v":0},null,null,{"$f":"Tabelle2125[[#This Row],[Menge\n    *)]]*-1","v":0}]
[null,null,null,null,"SATA HDD 6GB/s",{"$f":"SUM(F42)","v":0}]
[null,null,null,null,"651G6002",0,"GRAFENTHAL HDD 1TB 2,5'' SATA 7200RPM","32MB CACHE 6GB/S BAUHÖHE 9.5MM","FUER SERVER UND WORKSTATION",null,null,null,null,null,null,null,null,null,null,null,null,{"$f":"Tabelle2125[[#This Row],[Menge\n    *)]]*-1","v":0},null,null,{"$f":"Tabelle2125[[#This Row],[Menge\n    *)]]*-1","v":0}]
[null,null,null,null,"SATA 3,5 HDD 6GB/s",{"$f":"SUM(F44)","v":0}]
[null,null,null,null,"651G3001",0,"GRAFENTHAL HDD 1TB 3.5'' SATA 6GB/S","64MB 7200RPM 24/7"," ",null,null,null,null,null,null,null,null,null,null,null,null,{"$f":"Tabelle2125[[#This Row],[Menge\n    *)]]*-1","v":0},null,null,null,{"$f":"Tabelle2125[[#This Row],[Menge\n    *)]]*-1","v":0}]
[null,null,null,null,"651G6024",0,"HDD 2TB S-ATA 7,2K 3,5“ 6GB/S 24/7","FOR GRAFENTHAL SERVER","MTTF 2.0M HOURS",null,null,null,null,null,null,null,null,null,null,null,null,{"$f":"Tabelle2125[[#This Row],[Menge\n    *)]]*-1","v":0},null,null,null,{"$f":"Tabelle2125[[#This Row],[Menge\n    *)]]*-1","v":0}]
[null,null,null,null,"651G6023",0,"GRAFENTHAL HDD 4TB S-ATA 7,2K 3,5“","6GB/S 24/7","MTTF 2.0M HOURS",null,null,null,null,null,null,null,null,null,null,null,null,{"$f":"Tabelle2125[[#This Row],[Menge\n    *)]]*-1","v":0},null,null,null,{"$f":"Tabelle2125[[#This Row],[Menge\n    *)]]*-1","v":0}]
[null,null,null,null,"651G6022",0,"HDD 6TB S-ATA 7,2K 3,5“ 6GB/S 24/7","FOR GRAFENTHAL SERVER","MTTF 2.0M HOURS",null,null,null,null,null,null,null,null,null,null,null,null,{"$f":"Tabelle2125[[#This Row],[Menge\n    *)]]*-1","v":0},null,null,null,{"$f":"Tabelle2125[[#This Row],[Menge\n    *)]]*-1","v":0}]
[null,null,null,null,"651G6025",0,"HDD 10TB S-ATA 7,2K 3,5“ 6GB/S 24/7","FOR GRAFENTHAL SERVER","MTTF 2.0M HOURS",null,null,null,null,null,null,null,null,null,null,null,null,{"$f":"Tabelle2125[[#This Row],[Menge\n    *)]]*-1","v":0},null,null,null,{"$f":"Tabelle2125[[#This Row],[Menge\n    *)]]*-1","v":0}]
[null,null,null,null,"SSD M.2 NVMe",{"$f":"SUM(F50:F52)","v":0},""]
[null,null,null,null,"651G7000",0,"GRAFENTHAL SSD 512GB NVME M.2","PCIe 3.0 x4 READ 3500MB/S WRITE 2100MB/S"," ",null,null,null,null,null,null,null,null,null,null,null,null,{"$f":"Tabelle2125[[#This Row],[Menge\n    *)]]*-1","v":0},null,null,null,null,null,null,null,null,null,null,null,null,null,null,null,null,{"$f":"Tabelle2125[[#This Row],[Menge\n    *)]]*-1","v":0}]
[null,null,null,null,"651G7001",0,"GRAFENTHAL SSD 1TB NVME M.2","PCIe 3.0 x4 READ 3500MB/S WRITE 2100MB/S"," ",null,null,null,null,null,null,null,null,null,null,null,null,{"$f":"Tabelle2125[[#This Row],[Menge\n    *)]]*-1","v":0},null,null,null,null,null,null,null,null,null,null,null,null,null,null,null,null,{"$f":"Tabelle2125[[#This Row],[Menge\n    *)]]*-1","v":0}]
[null,null,null,null,"651G7002",0,"GRAFENTHAL SSD 2TB NVME M.2","PCIe 3.0 x4 READ 3500MB/S WRITE 2100MB/S"," ",null,null,null,null,null,null,null,null,null,null,null,null,{"$f":"Tabelle2125[[#This Row],[Menge\n    *)]]*-1","v":0},null,null,null,null,null,null,null,null,null,null,null,null,null,null,null,null,{"$f":"Tabelle2125[[#This Row],[Menge\n    *)]]*-1","v":0}]
[null,null,null,null,"SSD M.2 SATA",{"$f":"SUM(F54:F56)","v":0},""]
[null,null,null,null,"651G8000",0,"GRAFENTHAL SSD 256GB M.2 2280 SATA 6GB/S","256BIT-AES MTBF 1.6M HOURS TBW 144TB"," ",null,null,null,null,null,null,null,null,null,null,null,null,{"$f":"Tabelle2125[[#This Row],[Menge\n    *)]]*-1","v":0},null,null,null,null,null,null,null,null,null,null,null,null,null,null,null,null,{"$f":"Tabelle2125[[#This Row],[Menge\n    *)]]*-1","v":0}]
[null,null,null,null,"651G8001",0,"GRAFENTHAL SSD 512GB M.2 2280 SATA 6GB/S","256BIT-AES MTBF 1.6M HOURS TBW 288TB"," ",null,null,null,null,null,null,null,null,null,null,null,null,{"$f":"Tabelle2125[[#This Row],[Menge\n    *)]]*-1","v":0},null,null,null,null,null,null,null,null,null,null,null,null,null,null,null,null,{"$f":"Tabelle2125[[#This Row],[Menge\n    *)]]*-1","v":0}]
[null,null,null,null,"651G8002",0,"GRAFENTHAL SSD 1TB M.2 2280 SATA 6GB/S","256BIT-AES TCG OPAL 2.0 MTBF 1.5M HOURS"," ",null,null,null,null,null,null,null,null,null,null,null,null,{"$f":"Tabelle2125[[#This Row],[Menge\n    *)]]*-1","v":0},null,null,null,null,null,null,null,null,null,null,null,null,null,null,null,null,{"$f":"Tabelle2125[[#This Row],[Menge\n    *)]]*-1","v":0}]
[null,null,null,null,"KVM Upgrade",{"$f":"SUM(F58)","v":0}]
[null,null,null,null,"653G6006",0,"GRAFENTHAL KVM UPGRADE CHIP","FOR R1104 S2"," "]
[null,null,null,null,"MPAC",{"$f":"SUM(F60:F77)","v":0}]
[null,null,null,null,"740M6228",0,"GRAFENTHAL MPAC VOR ORT SERVICE UPGRADE","3 JAHRE 13x5 24STUNDEN WIEDERHERSTELLUNG","FÜR GRAFENTHAL R1104 S2"]
[null,null,null,null,"740M6229",0,"GRAFENTHAL MPAC VOR ORT SERVICE UPGRADE","3 JAHRE 13x5 12STUNDEN WIEDERHERSTELLUNG","FÜR GRAFENTHAL R1104 S2"]
[null,null,null,null,"740M6230",0,"GRAFENTHAL MPAC VOR ORT SERVICE UPGRADE","3 JAHRE 24x7 6 STUNDEN WIEDERHERSTELLUNG","FÜR GRAFENTHAL R1104 S2"]
[null,null,null,null,"740M6231",0,"GRAFENTHAL MPAC VOR ORT SERVICE UPGRADE","4 JAHRE 13x5 24STUNDEN WIEDERHERSTELLUNG","FÜR GRAFENTHAL R1104 S2"]
[null,null,null,null,"740M6232",0,"GRAFENTHAL MPAC VOR ORT SERVICE UPGRADE","4 JAHRE 13x5 12STUNDEN WIEDERHERSTELLUNG","FÜR GRAFENTHAL R1104 S2"]
[null,null,null,null,"740M6233",0,"GRAFENTHAL MPAC VOR ORT SERVICE UPGRADE","4 JAHRE 24x7 6 STUNDEN WIEDERHERSTELLUNG","FÜR GRAFENTHAL R1104 S2"]
[null,null,null,null,"740M6234",0,"GRAFENTHAL MPAC VOR ORT SERVICE UPGRADE","5 JAHRE 13x5 24STUNDEN WIEDERHERSTELLUNG","FÜR GRAFENTHAL R1104 S2"]
[null,null,null,null,"740M6235",0,"GRAFENTHAL MPAC VOR ORT SERVICE UPGRADE","5 JAHRE 13x5 12STUNDEN WIEDERHERSTELLUNG","FÜR GRAFENTHAL R1104 S2"]
[null,null,null,null,"740M6236",0,"GRAFENTHAL MPAC VOR ORT SERVICE UPGRADE","5 JAHRE 24x7 6 STUNDEN WIEDERHERSTELLUNG","FÜR GRAFENTHAL R1104 S2"]
[null,null,null,null,"740M6237",0,"GRAFENTHAL MPAC VOR ORT SERVICE UPGRADE","3 JAHRE 13x5 24STD WIEDERHERSTELLUNG DMR","FÜR GRAFENTHAL R1104 S2"]
[null,null,null,null,"740M6238",0,"GRAFENTHAL MPAC VOR ORT SERVICE UPGRADE","3 JAHRE 13x5 12STD WIEDERHERSTELLUNG DMR","FÜR GRAFENTHAL R1104 S2"]
[null,null,null,null,"740M6239",0,"GRAFENTHAL MPAC VOR ORT SERVICE UPGRADE","3 JAHRE 24x7 6STD WIEDERHERSTELLUNG DMR","FÜR GRAFENTHAL R1104 S2"]
[null,null,null,null,"740M6240",0,"GRAFENTHAL MPAC VOR ORT SERVICE UPGRADE","4 JAHRE 13x5 24STD WIEDERHERSTELLUNG DMR","FÜR GRAFENTHAL R1104 S2"]
[null,null,null,null,"740M6241",0,"GRAFENTHAL MPAC VOR ORT SERVICE UPGRADE","4 JAHRE 13x5 12STD WIEDERHERSTELLUNG DMR","FÜR GRAFENTHAL R1104 S2"]
[null,null,null,null,"740M6242",0,"GRAFENTHAL MPAC VOR ORT SERVICE UPGRADE","4 JAHRE 24x7 6STD WIEDERHERSTELLUNG DMR","FÜR GRAFENTHAL R1104 S2"]
[null,null,null,null,"740M6243",0,"GRAFENTHAL MPAC VOR ORT SERVICE UPGRADE","5 JAHRE 13x5 24STD WIEDERHERSTELLUNG DMR","FÜR GRAFENTHAL R1104 S2"]
[null,null,null,null,"740M6244",0,"GRAFENTHAL MPAC VOR ORT SERVICE UPGRADE","5 JAHRE 13x5 12STD WIEDERHERSTELLUNG DMR","FÜR GRAFENTHAL R1104 S2"]
[null,null,null,null,"740M6245",0,"GRAFENTHAL MPAC VOR ORT SERVICE UPGRADE","5 JAHRE 24x7 6STD WIEDERHERSTELLUNG DMR","FÜR GRAFENTHAL R1104 S2"]
[null,null,null,null,"CONFIG-TO-ORDER",{"$f":"SUM(F79:F82)","v":0}]
[null,null,null,null,"CTO",0,"HARDWARE ASSEMBLIERUNG"]
[null,null,null,null,"CTO1",0,"HARDWARE ASSEMBLIERUNG & FIRMWARE UPDATE"]
[null,null,null,null,"CTO2",0,"HARDWARE ASSEMBLIERUNG, FIRMWARE UPDATE & RAID EINRICHTUNG"]
[null,null,null,null,"CTO3",0,"HARDWARE ASSEMBLIERUNG, FIRMWARE UPDATE, RAID EINRICHTUNG & OS INSTALLATION"]
[null,null,null,null,"USB Drive",{"$f":"SUM(F84)","v":0}]
[null,null,null,null,"652G6004",0,"GRAFENTHAL USB 3.0 FLASH DRIVE","ULTRA FIT 64GB UP TO 150MB/S"," "]
[null,null,null,null,"USV- Systeme",{"$f":"SUM(F86:F89)","v":0}]
[null,null,null,null,"132G0150",0,"GRAFENTHAL USV ETR-1500 TOWER RACK LINE","INTERACTIVE 1500VA 1200W PURE SINEWAVE","ECO MODE 23KG CE ROHS GERMAN"]
[null,null,null,null,"132G0300",0,"GRAFENTHAL USV ETR-3000 TOWER RACK LINE","INTERACTIVE 3000VA 2400W PURE SINEWAVE","ECO MODE 35KG CE ROHS GERMAN"]
[null,null,null,null,"113G1150",0,"GRAFENTHAL USV PR-1500-HS PROGRAMMABLE","ECO MODE RACK MOUNT 2U USB RS232 LCD"," "]
[null,null,null,null,"113G1300",0,"GRAFENTHAL USV PR-3000-HS ONLINE","ECO MODE RACK MOUNT 2U USB RS232 LCD"," "]
[null,null,null,null,"USV- Zubehör",{"$f":"SUM(F91:F92)","v":0}]
[null,null,null,null,"149G6005",0,"GRAFENTHAL USV SNMP CARD PRO S2","FOR ETR AND PR AND PTR SERIES","MULTI SERVER SHUTDOWN"]
[null,null,null,null,"149G5003",0,"GRAFENTHAL USV ACCESSORY LICENSE FOR","SNMP PRO CARD FOR ETR AND PR SERIES","MULTI SERVER SHUTDOWN"]
[null,null,null,null,"SUMME",1,null,null,null,{"$f":"COUNTIF($J$94:$AN$94,\"<0\")","v":0}]
[null,null,null,null,null,null,null,null,null,{"$f":"SUM(J14:J92)","v":0},0,0,0,0,0,0,0,0,0,0,0,0,0,0,0,0,0,0,0,0,0,0,0,0,0,0,0,0,0,0]

{"sheet":"R2108 S2","index":7,"n_rows":166,"n_cols":30,"rows_kept":166,"cut":false,"hidden":false,"merged":[[0,4,0,8]]}
[null,null,null,null,"1U Rackserver R2108 S2"]
[]
[null,null,null,null,null,null,null,"wei CPU Sockets der Intel® Xeon® E5-2600 v4-Produktfamilie","more Info"]
[null,null,null,null,null,null,null,"erweiterbar auf bis zu 8 x 2,5“ HDD oder SSD"]
[null,null,null,null,null,null,null,"LSI 3008 SAS Chipsatz für RAID 0, 1, 5 und 10"]
[null,null,null,null,null,null,null,"4x Gigabit Ethernet RJ45"]
[null,null,null,null,null,null,null,"Integrierter Remote- Management Controller","* Felder werden automatisch ausgefüllt"]
[null,null,null,null,null,null,null,null,"*) \"Menge\" filtern um Konfiguration anzuzeigen"]
[]
[]
[null,null,null,null,"Konfigurator",null,{"$f":"'Revision Info'!B10","v":"Revision 15"}]
[null,null,null,null,"ART. NR.","Menge\n    *)","Bezeichnung","Bezeichnung II","Bezeichung III","nicht kombinierbar","nicht konfigurierbar","CPU slots","MEM Slots","SSD Slots","HDD Slots HS 2.5","HDD Slots HS 3.5","HDD Slots HS SAS","HDD Slots HS SATA","HDD Slots NHS SAS","HDD Slots NHS SATA","SAS Ports","CacheCade","3,5 Slots","Open-E","PCI x1 Slots","PCI x4 Slots","PCI x8 Slots","PCI x16 Slots","DVD Slot","PSU Slot"]
[null,null,null,null,"Maschinentyp",{"$f":"SUM(F14:F14)","v":0},null,null,null,"if (Kombi);-1;0","if Menge;-1;0","(Menge x Eigenschaft)","(Menge x Eigenschaft)","(Menge x Eigenschaft)","(Menge x Eigenschaft)","(Menge x Eigenschaft)","(Menge x Eigenschaft)","(Menge x Eigenschaft)","(Menge x Eigenschaft)","(Menge x Eigenschaft)","(Menge x Eigenschaft)","(Menge x Eigenschaft)","(Menge x Eigenschaft)","(Menge x Eigenschaft)","(Menge x Eigenschaft)","(Menge x Eigenschaft)","(Menge x Eigenschaft)","(Menge x Eigenschaft)","(Menge x Eigenschaft)","(Menge x Eigenschaft)"]
[null,null,null,null,"611G5201",0,"GRAFENTHAL CTO RACK SERVER 1U R2108 S2","2x E5-2600 V4 SOCKETS 8x 2,5\\ BAYS\"","MAX 16xDIMMS 1x4N-I350 1/2 PSU 550W",null,null,{"$f":"Tabelle2[[#This Row],[Menge\n    *)]]*2","v":0},{"$f":"Tabelle2[[#This Row],[Menge\n    *)]]*0","v":0},{"$f":"Tabelle2[[#This Row],[Menge\n    *)]]*8","v":0},{"$f":"Tabelle2[[#This Row],[Menge\n    *)]]*8","v":0},{"$f":"Tabelle2[[#This Row],[Menge\n    *)]]*0","v":0},{"$f":"Tabelle2[[#This Row],[Menge\n    *)]]*8","v":0},{"$f":"Tabelle2[[#This Row],[Menge\n    *)]]*8","v":0},{"$f":"Tabelle2[[#This Row],[Menge\n    *)]]*0","v":0},{"$f":"Tabelle2[[#This Row],[Menge\n    *)]]*0","v":0},{"$f":"Tabelle2[[#This Row],[Menge\n    *)]]*8","v":0},{"$f":"Tabelle2[[#This Row],[Menge\n    *)]]*0","v":0},{"$f":"Tabelle2[[#This Row],[Menge\n    *)]]*0","v":0},{"$f":"Tabelle2[[#This Row],[Menge\n    *)]]*0","v":0},{"$f":"Tabelle2[[#This Row],[Menge\n    *)]]*0","v":0},{"$f":"Tabelle2[[#This Row],[Menge\n    *)]]*0","v":0},{"$f":"Tabelle2[[#This Row],[Menge\n    *)]]*0","v":0},{"$f":"Tabelle2[[#This Row],[Menge\n    *)]]*0","v":0},{"$f":"Tabelle2[[#This Row],[Menge\n    *)]]*1","v":0},{"$f":"Tabelle2[[#This Row],[Menge\n    *)]]*1","v":0}]
[null,null,null,null,"Prozessor",{"$f":"SUM(F16:F16,F18:F28)","v":0}]
[null,null,null,null,"656G6002",0,"GRAFENTHAL CPU XEON E5-2603 V3 6CORE","1,6GHz LGA2011V3 15MB CACHE 6 THREADS"," ",{"$f":"IF(COUNTIF($F$16,\"<>0\")+COUNTIF($F$18:$F$28,\"<>0\")>1,-1,0)","v":0},null,{"$f":"Tabelle2[[#This Row],[Menge\n    *)]]*-1","v":0},{"$f":"Tabelle2[[#This Row],[Menge\n    *)]]*8","v":0},"X","X","X","X","X","X","X","X","X","X",{"$f":"Tabelle2[[#This Row],[Menge\n    *)]]*1","v":0},{"$f":"Tabelle2[[#This Row],[Menge\n    *)]]*1","v":0},{"$f":"Tabelle2[[#This Row],[Menge\n    *)]]*1","v":0},{"$f":"Tabelle2[[#This Row],[Menge\n    *)]]*1","v":0},{"$f":"Tabelle2[[#This Row],[Menge\n    *)]]*0.5","v":0},"X","X"]
[null,null,null,null,"V4 Prozessoren"]
[null,null,null,null,"656G6016",0,"GRAFENTHAL CPU XEON E5-2637 V4 4CORE","3,5Ghz LGA2011V3 15MB CACHE 8 THREADS"," ",null,null,{"$f":"Tabelle2[[#This Row],[Menge\n    *)]]*-1","v":0},{"$f":"Tabelle2[[#This Row],[Menge\n    *)]]*8","v":0},"X","X","X","X","X","X","X","X","X","X","X",{"$f":"Tabelle2[[#This Row],[Menge\n    *)]]*1","v":0},{"$f":"Tabelle2[[#This Row],[Menge\n    *)]]*1","v":0},{"$f":"Tabelle2[[#This Row],[Menge\n    *)]]*1","v":0},{"$f":"Tabelle2[[#This Row],[Menge\n    *)]]*0.5","v":0},"X","X"]
[null,null,null,null,"656G6017",0,"GRAFENTHAL CPU XEON E5-2603 V4 6CORE","1,7Ghz LGA2011V3 15MB CACHE 6 THREADS"," ",null,null,{"$f":"Tabelle2[[#This Row],[Menge\n    *)]]*-1","v":0},{"$f":"Tabelle2[[#This Row],[Menge\n    *)]]*8","v":0},"X","X","X","X","X","X","X","X","X","X","X",{"$f":"Tabelle2[[#This Row],[Menge\n    *)]]*1","v":0},{"$f":"Tabelle2[[#This Row],[Menge\n    *)]]*1","v":0},{"$f":"Tabelle2[[#This Row],[Menge\n    *)]]*1","v":0},{"$f":"Tabelle2[[#This Row],[Menge\n    *)]]*0.5","v":0},"X","X"]
[null,null,null,null,"656G6018",0,"GRAFENTHAL CPU XEON E5-2609 V4 8CORE","1,7Ghz LGA2011V3 20MB CACHE 8 THREADS"," ",null,null,{"$f":"Tabelle2[[#This Row],[Menge\n    *)]]*-1","v":0},{"$f":"Tabelle2[[#This Row],[Menge\n    *)]]*8","v":0},"X","X","X","X","X","X","X","X","X","X","X",{"$f":"Tabelle2[[#This Row],[Menge\n    *)]]*1","v":0},{"$f":"Tabelle2[[#This Row],[Menge\n    *)]]*1","v":0},{"$f":"Tabelle2[[#This Row],[Menge\n    *)]]*1","v":0},{"$f":"Tabelle2[[#This Row],[Menge\n    *)]]*0.5","v":0},"X","X"]
[null,null,null,null,"656G6019",0,"GRAFENTHAL CPU XEON E5-2620 V4 8CORE","2,1GHz LGA2011V3 20MB CACHE 16 THREADS"," ",null,null,{"$f":"Tabelle2[[#This Row],[Menge\n    *)]]*-1","v":0},{"$f":"Tabelle2[[#This Row],[Menge\n    *)]]*8","v":0},"X","X","X","X","X","X","X","X","X","X","X",{"$f":"Tabelle2[[#This Row],[Menge\n    *)]]*1","v":0},{"$f":"Tabelle2[[#This Row],[Menge\n    *)]]*1","v":0},{"$f":"Tabelle2[[#This Row],[Menge\n    *)]]*1","v":0},{"$f":"Tabelle2[[#This Row],[Menge\n    *)]]*0.5","v":0},"X","X"]
[null,null,null,null,"656G6020",0,"GRAFENTHAL CPU XEON E5-2630v4 2.20GHz","10C 25MB 85W"," ",null,null,{"$f":"Tabelle2[[#This Row],[Menge\n    *)]]*-1","v":0},{"$f":"Tabelle2[[#This Row],[Menge\n    *)]]*8","v":0},"X","X","X","X","X","X","X","X","X","X","X",{"$f":"Tabelle2[[#This Row],[Menge\n    *)]]*1","v":0},{"$f":"Tabelle2[[#This Row],[Menge\n    *)]]*1","v":0},{"$f":"Tabelle2[[#This Row],[Menge\n    *)]]*1","v":0},{"$f":"Tabelle2[[#This Row],[Menge\n    *)]]*0.5","v":0},"X","X"]
[null,null,null,null,"656G6021",0,"GRAFENTHAL CPU XEON E5-2640 V4 10CORE","2,4Ghz LGA2011V3 25MB CACHE 20 THREADS"," ",null,null,{"$f":"Tabelle2[[#This Row],[Menge\n    *)]]*-1","v":0},{"$f":"Tabelle2[[#This Row],[Menge\n    *)]]*8","v":0},"X","X","X","X","X","X","X","X","X","X","X",{"$f":"Tabelle2[[#This Row],[Menge\n    *)]]*1","v":0},{"$f":"Tabelle2[[#This Row],[Menge\n    *)]]*1","v":0},{"$f":"Tabelle2[[#This Row],[Menge\n    *)]]*1","v":0},{"$f":"Tabelle2[[#This Row],[Menge\n    *)]]*0.5","v":0},"X","X"]
[null,null,null,null,"656G6022",0,"GRAFENTHAL CPU XEON E5-2650 V4 12CORE","2,2Ghz LGA2011V3 30MB CACHE 24 THREADS"," ",null,null,{"$f":"Tabelle2[[#This Row],[Menge\n    *)]]*-1","v":0},{"$f":"Tabelle2[[#This Row],[Menge\n    *)]]*8","v":0},"X","X","X","X","X","X","X","X","X","X","X",{"$f":"Tabelle2[[#This Row],[Menge\n    *)]]*1","v":0},{"$f":"Tabelle2[[#This Row],[Menge\n    *)]]*1","v":0},{"$f":"Tabelle2[[#This Row],[Menge\n    *)]]*1","v":0},{"$f":"Tabelle2[[#This Row],[Menge\n    *)]]*0.5","v":0},"X","X"]
[null,null,null,null,"656G6026",0,"GRAFENTHAL CPU XEON E5-2687W V4 12CORE","3.00GHz LGA2011 30MB CACHE 24 THREADS"," ",null,null,{"$f":"Tabelle2[[#This Row],[Menge\n    *)]]*-1","v":0},{"$f":"Tabelle2[[#This Row],[Menge\n    *)]]*8","v":0},"X","X","X","X","X","X","X","X","X","X","X",{"$f":"Tabelle2[[#This Row],[Menge\n    *)]]*1","v":0},{"$f":"Tabelle2[[#This Row],[Menge\n    *)]]*1","v":0},{"$f":"Tabelle2[[#This Row],[Menge\n    *)]]*1","v":0},{"$f":"Tabelle2[[#This Row],[Menge\n    *)]]*0.5","v":0},"X","X"]
[null,null,null,null,"656G6023",0,"GRAFENTHAL CPU XEON E5-2660 V4 14CORE","2,0Ghz LGA2011V3 35MB CACHE 28 THREADS"," ",null,null,{"$f":"Tabelle2[[#This Row],[Menge\n    *)]]*-1","v":0},{"$f":"Tabelle2[[#This Row],[Menge\n    *)]]*8","v":0},"X","X","X","X","X","X","X","X","X","X","X",{"$f":"Tabelle2[[#This Row],[Menge\n    *)]]*1","v":0},{"$f":"Tabelle2[[#This Row],[Menge\n    *)]]*1","v":0},{"$f":"Tabelle2[[#This Row],[Menge\n    *)]]*1","v":0},{"$f":"Tabelle2[[#This Row],[Menge\n    *)]]*0.5","v":0},"X","X"]
[null,null,null,null,"656G6024",0,"GRAFENTHAL CPU XEON E5-2680 V4 14CORE","2,40GHz LGA2011 35MB CACHE 28 THREADS"," ",null,null,{"$f":"Tabelle2[[#This Row],[Menge\n    *)]]*-1","v":0},{"$f":"Tabelle2[[#This Row],[Menge\n    *)]]*8","v":0},"X","X","X","X","X","X","X","X","X","X","X",{"$f":"Tabelle2[[#This Row],[Menge\n    *)]]*1","v":0},{"$f":"Tabelle2[[#This Row],[Menge\n    *)]]*1","v":0},{"$f":"Tabelle2[[#This Row],[Menge\n    *)]]*1","v":0},{"$f":"Tabelle2[[#This Row],[Menge\n    *)]]*0.5","v":0},"X","X"]
[null,null,null,null,"656G6025",0,"GRAFENTHAL CPU XEON E5-2690 V4 14CORE","2,6Ghz LGA2011V3 35MB CACHE 28 THREADS"," ",null,null,{"$f":"Tabelle2[[#This Row],[Menge\n    *)]]*-1","v":0},{"$f":"Tabelle2[[#This Row],[Menge\n    *)]]*8","v":0},"X","X","X","X","X","X","X","X","X","X","X",{"$f":"Tabelle2[[#This Row],[Menge\n    *)]]*1","v":0},{"$f":"Tabelle2[[#This Row],[Menge\n    *)]]*1","v":0},{"$f":"Tabelle2[[#This Row],[Menge\n    *)]]*1","v":0},{"$f":"Tabelle2[[#This Row],[Menge\n    *)]]*0.5","v":0},"X","X"]
[null,null,null,null,"Heatsink",{"$f":"SUM(F30)","v":0}]
[null,null,null,null,"659G6014",{"$f":"IF(OR(SUM(F16:F16)>0,SUM(F18:F28)>0),SUM(F16:F16)+SUM(F18:F28)*1,0)","v":0},"GRAFENTHAL CPU COOLER FOR R2108 S2"," "," ",null,null,null,"X","X","X","X","X","X","X","X","X","X","X","X","X","X","X","X","X","X"]
[null,null,null,null,"Arbeitsspeicher",{"$f":"SUM(F32:F35)","v":0}]
[null,null,null,null,"652G7000",0,"GRAFENTHAL MEM 16GB DDR4 2400MHz RDIMM","PC4-19200 CL17 DUAL RANKED ECC"," ",null,null,null,{"$f":"Tabelle2[[#This Row],[Menge\n    *)]]*-1","v":0},"X","X","X","X","X","X","X","X","X","X","X","X","X","X","X","X","X"]
[null,null,null,null,"652G7001",0,"GRAFENTHAL MEM 16GB DDR4 2400MHz LRDIMM","PC4-19200L CL17 DUAL RANKED ECC"," ",null,null,null,{"$f":"Tabelle2[[#This Row],[Menge\n    *)]]*-1","v":0}]
[null,null,null,null,"652G6011",0,"GRAFENTHAL MEM 32GB DDR4-2400MHz RDIMM","PC4-19200 CL17 DUAL RANKED ECC"," ",null,null,null,{"$f":"Tabelle2[[#This Row],[Menge\n    *)]]*-1","v":0},"X","X","X","X","X","X","X","X","X","X","X","X","X","X","X","X","X"]
[null,null,null,null,"652G7002",0,"GRAFENTHAL MEM 32GB DDR4 2400MHz LRDIMM","PC4-19200L CL17 DUAL RANKED ECC"," ",null,null,null,{"$f":"Tabelle2[[#This Row],[Menge\n    *)]]*-1","v":0}]
[null,null,null,null,"HDD HotSwap",{"$f":"SUM(F38:F39)","v":0}]
[null,null,null,null,"SATA SSD 6GB/s *MIDRANGE*",{"$f":"SUM(F38:F39)","v":0}]
[null,null,null,null,"651G7011",0,"GRAFENTHAL SSD 240GB 2.5'' SATA 6GB/S","MIDRANGE 599 TBW"," ",null,null,null,"X",{"$f":"Tabelle2[[#This Row],[Menge\n    *)]]*-1","v":0},{"$f":"Tabelle2[[#This Row],[Menge\n    *)]]*-1","v":0},"X",{"$f":"Tabelle2[[#This Row],[Menge\n    *)]]*-1","v":0},{"$f":"Tabelle2[[#This Row],[Menge\n    *)]]*-1","v":0},"X","X","X","X","X","X","X","X","X","X","X","X"]
[null,null,null,null,"651G7012",0,"GRAFENTHAL SSD 480GB 2.5'' SATA 6GB/S","MIDRANGE 945 TBW"," ",null,null,null,"X",{"$f":"Tabelle2[[#This Row],[Menge\n    *)]]*-1","v":0},{"$f":"Tabelle2[[#This Row],[Menge\n    *)]]*-1","v":0},"X",{"$f":"Tabelle2[[#This Row],[Menge\n    *)]]*-1","v":0},{"$f":"Tabelle2[[#This Row],[Menge\n    *)]]*-1","v":0},"X","X","X","X","X","X","X","X","X","X","X","X"]
[null,null,null,null,"SATA SSD 6GB/s *ENTRY*",{"$f":"SUM(F41:F44)","v":0},{"$error":"#N/A"}]
[null,null,null,null,"651G8024",0,"GRAFENTHAL SSD 256GB SATA3 6GB/S 2.5''","MTBF 1.5M HOURS TBW 300TB"," ",null,null,null,"X",{"$f":"Tabelle2[[#This Row],[Menge\n    *)]]*-1","v":0},{"$f":"Tabelle2[[#This Row],[Menge\n    *)]]*-1","v":0},null,{"$f":"Tabelle2[[#This Row],[Menge\n    *)]]*-1","v":0},{"$f":"Tabelle2[[#This Row],[Menge\n    *)]]*-1","v":0},"X","X","X","X","X","X","X","X","X","X","X","X"]
[null,null,null,null,"651G8025",0,"GRAFENTHAL SSD 512GB SATA3 6GB/S 2.5''","MTBF 1.5M HOURS TBW 300TB"," ",null,null,null,"X",{"$f":"Tabelle2[[#This Row],[Menge\n    *)]]*-1","v":0},{"$f":"Tabelle2[[#This Row],[Menge\n    *)]]*-1","v":0},null,{"$f":"Tabelle2[[#This Row],[Menge\n    *)]]*-1","v":0},{"$f":"Tabelle2[[#This Row],[Menge\n    *)]]*-1","v":0},"X","X","X","X","X","X","X","X","X","X","X","X"]
[null,null,null,null,"651G8026",0,"GRAFENTHAL SSD 1TB SATA3 6GB/S 2.5''","MTBF 1.5M HOURS TBW 300TB"," ",null,null,null,"X",{"$f":"Tabelle2[[#This Row],[Menge\n    *)]]*-1","v":0},{"$f":"Tabelle2[[#This Row],[Menge\n    *)]]*-1","v":0},null,{"$f":"Tabelle2[[#This Row],[Menge\n    *)]]*-1","v":0},{"$f":"Tabelle2[[#This Row],[Menge\n    *)]]*-1","v":0},"X","X","X","X","X","X","X","X","X","X","X","X"]
[null,null,null,null,"651G8027",0,"GRAFENTHAL SSD 2TB SATA3 6GB/S 2.5''","MTBF 1.5M HOURS TBW 300TB"," ",null,null,null,"X",{"$f":"Tabelle2[[#This Row],[Menge\n    *)]]*-1","v":0},{"$f":"Tabelle2[[#This Row],[Menge\n    *)]]*-1","v":0},null,{"$f":"Tabelle2[[#This Row],[Menge\n    *)]]*-1","v":0},{"$f":"Tabelle2[[#This Row],[Menge\n    *)]]*-1","v":0},"X","X","X","X","X","X","X","X","X","X","X","X"]
[null,null,null,null,"SATA HDD 6GB/s",{"$f":"SUM(F46)","v":0}]
[null,null,null,null,"651G6002",0,"GRAFENTHAL HDD 1TB 2,5'' SATA 7200RPM","32MB CACHE 6GB/S BAUHÖHE 9.5MM","FUER SERVER UND WORKSTATION",null,null,null,"X",{"$f":"Tabelle2[[#This Row],[Menge\n    *)]]*-1","v":0},{"$f":"Tabelle2[[#This Row],[Menge\n    *)]]*-1","v":0},"X",{"$f":"Tabelle2[[#This Row],[Menge\n    *)]]*-1","v":0},{"$f":"Tabelle2[[#This Row],[Menge\n    *)]]*-1","v":0},"X","X","X","X","X","X","X","X","X","X","X","X"]
[null,null,null,null,"SAS 2,5\" 10k 12GB/s",{"$f":"SUM(F48:F53)","v":0}]
[null,null,null,null,"651G8020",0,"GRAFENTHAL HDD 300GB 10K 2.5'' SAS","12GB/S"," ",null,null,null,"X",{"$f":"Tabelle2[[#This Row],[Menge\n    *)]]*-1","v":0},{"$f":"Tabelle2[[#This Row],[Menge\n    *)]]*-1","v":0},"X",{"$f":"Tabelle2[[#This Row],[Menge\n    *)]]*-1","v":0},{"$f":"Tabelle2[[#This Row],[Menge\n    *)]]*-1","v":0},"X","X","X","X","X","X","X","X","X","X","X","X"]
[null,null,null,null,"651G8005",0,"GRAFENTHAL HDD 600GB 10K 2.5\\ SAS 12GB/S\""," "," ",null,null,null,"X",{"$f":"Tabelle2[[#This Row],[Menge\n    *)]]*-1","v":0},{"$f":"Tabelle2[[#This Row],[Menge\n    *)]]*-1","v":0},"X",{"$f":"Tabelle2[[#This Row],[Menge\n    *)]]*-1","v":0},{"$f":"Tabelle2[[#This Row],[Menge\n    *)]]*-1","v":0},"X","X","X","X","X","X","X","X","X","X","X","X"]
[null,null,null,null,"651G8006",0,"GRAFENTHAL HDD 900GB 10K 2.5\\ SAS 12GB/S\""," "," ",null,null,null,"X",{"$f":"Tabelle2[[#This Row],[Menge\n    *)]]*-1","v":0},{"$f":"Tabelle2[[#This Row],[Menge\n    *)]]*-1","v":0},"X",{"$f":"Tabelle2[[#This Row],[Menge\n    *)]]*-1","v":0},{"$f":"Tabelle2[[#This Row],[Menge\n    *)]]*-1","v":0},"X","X","X","X","X","X","X","X","X","X","X","X"]
[null,null,null,null,"651G8007",0,"GRAFENTHAL HDD 1.2TB 10K 2.5\\ SAS 12GB/S\""," "," ",null,null,null,"X",{"$f":"Tabelle2[[#This Row],[Menge\n    *)]]*-1","v":0},{"$f":"Tabelle2[[#This Row],[Menge\n    *)]]*-1","v":0},"X",{"$f":"Tabelle2[[#This Row],[Menge\n    *)]]*-1","v":0},{"$f":"Tabelle2[[#This Row],[Menge\n    *)]]*-1","v":0},"X","X","X","X","X","X","X","X","X","X","X","X"]
[null,null,null,null,"651G8021",0,"GRAFENTHAL HDD 1.8TB 10K 2.5'' SAS","12GB/S"," ",null,null,null,"X",{"$f":"Tabelle2[[#This Row],[Menge\n    *)]]*-1","v":0},{"$f":"Tabelle2[[#This Row],[Menge\n    *)]]*-1","v":0},"X",{"$f":"Tabelle2[[#This Row],[Menge\n    *)]]*-1","v":0},{"$f":"Tabelle2[[#This Row],[Menge\n    *)]]*-1","v":0},"X","X","X","X","X","X","X","X","X","X","X","X"]
[null,null,null,null,"651G8022",0,"GRAFENTHAL HDD 2.4TB 10K 2.5'' SAS","12GB/S"," ",null,null,null,"X",{"$f":"Tabelle2[[#This Row],[Menge\n    *)]]*-1","v":0},{"$f":"Tabelle2[[#This Row],[Menge\n    *)]]*-1","v":0},"X",{"$f":"Tabelle2[[#This Row],[Menge\n    *)]]*-1","v":0},{"$f":"Tabelle2[[#This Row],[Menge\n    *)]]*-1","v":0},"X","X","X","X","X","X","X","X","X","X","X","X"]
[null,null,null,null,"SAS 2,5\" 15k 12GB/s",{"$f":"SUM(F55:F57)","v":0}]
[null,null,null,null,"651G8003",0,"GRAFENTHAL HDD 300GB 15K 2.5\\ SAS 12GB/S\""," "," ",null,null,null,"X",{"$f":"Tabelle2[[#This Row],[Menge\n    *)]]*-1","v":0},{"$f":"Tabelle2[[#This Row],[Menge\n    *)]]*-1","v":0},"X",{"$f":"Tabelle2[[#This Row],[Menge\n    *)]]*-1","v":0},{"$f":"Tabelle2[[#This Row],[Menge\n    *)]]*-1","v":0},"X","X","X","X","X","X","X","X","X","X","X","X"]
[null,null,null,null,"651G8004",0,"GRAFENTHAL HDD 600GB 15K 2.5\\ SAS 12GB/S\""," "," ",null,null,null,"X",{"$f":"Tabelle2[[#This Row],[Menge\n    *)]]*-1","v":0},{"$f":"Tabelle2[[#This Row],[Menge\n    *)]]*-1","v":0},"X",{"$f":"Tabelle2[[#This Row],[Menge\n    *)]]*-1","v":0},{"$f":"Tabelle2[[#This Row],[Menge\n    *)]]*-1","v":0},"X","X","X","X","X","X","X","X","X","X","X","X"]
[null,null,null,null,"651G8019",0,"GRAFENTHAL HDD 900GB 15K 2.5'' SAS","12GB/S"," ",null,null,null,"X",{"$f":"Tabelle2[[#This Row],[Menge\n    *)]]*-1","v":0},{"$f":"Tabelle2[[#This Row],[Menge\n    *)]]*-1","v":0},"X",{"$f":"Tabelle2[[#This Row],[Menge\n    *)]]*-1","v":0},{"$f":"Tabelle2[[#This Row],[Menge\n    *)]]*-1","v":0},"X","X","X","X","X","X","X","X","X","X","X","X"]
[null,null,null,null,"SAS SSD  12GB/s *MIDRANGE*",{"$f":"SUM(F59:F62)","v":0}]
[null,null,null,null,"651G7004",0,"GRAFENTHAL SSD 480GB 2,5'' SAS 12GB/S","MIDRANGE DWPD 1"," ",null,null,null,"X",{"$f":"Tabelle2[[#This Row],[Menge\n    *)]]*-1","v":0},{"$f":"Tabelle2[[#This Row],[Menge\n    *)]]*-1","v":0},null,{"$f":"Tabelle2[[#This Row],[Menge\n    *)]]*-1","v":0},{"$f":"Tabelle2[[#This Row],[Menge\n    *)]]*-1","v":0},"X","X","X","X","X","X","X","X","X","X","X","X"]
[null,null,null,null,"651G7005",0,"GRAFENTHAL SSD 960GB 2,5'' SAS 12GB/S","MIDRANGE DWPD 1"," ",null,null,null,"X",{"$f":"Tabelle2[[#This Row],[Menge\n    *)]]*-1","v":0},{"$f":"Tabelle2[[#This Row],[Menge\n    *)]]*-1","v":0},null,{"$f":"Tabelle2[[#This Row],[Menge\n    *)]]*-1","v":0},{"$f":"Tabelle2[[#This Row],[Menge\n    *)]]*-1","v":0},"X","X","X","X","X","X","X","X","X","X","X","X"]
[null,null,null,null,"651G7006",0,"GRAFENTHAL SSD 1920GB 2,5'' SAS 12GB/S","MIDRANGE DWPD 1"," ",null,null,null,"X",{"$f":"Tabelle2[[#This Row],[Menge\n    *)]]*-1","v":0},{"$f":"Tabelle2[[#This Row],[Menge\n    *)]]*-1","v":0},null,{"$f":"Tabelle2[[#This Row],[Menge\n    *)]]*-1","v":0},{"$f":"Tabelle2[[#This Row],[Menge\n    *)]]*-1","v":0},"X","X","X","X","X","X","X","X","X","X","X","X"]
[null,null,null,null,"651G7007",0,"GRAFENTHAL SSD 3840GB 2,5'' SAS 12GB/S","MIDRANGE DWPD 1"," ",null,null,null,"X",{"$f":"Tabelle2[[#This Row],[Menge\n    *)]]*-1","v":0},{"$f":"Tabelle2[[#This Row],[Menge\n    *)]]*-1","v":0},null,{"$f":"Tabelle2[[#This Row],[Menge\n    *)]]*-1","v":0},{"$f":"Tabelle2[[#This Row],[Menge\n    *)]]*-1","v":0},"X","X","X","X","X","X","X","X","X","X","X","X"]
[null,null,null,null,"SSD PCIe NVMe",{"$f":"SUM(F64:F66)","v":0},{"$error":"#N/A"}]
[null,null,null,null,"651G6030",0,"GRAFENTHAL SSD 800GB NVME ENTERPRISE","READ 3100MB/S WRITE 2350MB/S 32GT/S","PCI EXPRESS 3.0",null,null,null,"X","X","X","X","X","X","X","X","X","X","X","X",{"$f":"Tabelle2[[#This Row],[Menge\n    *)]]*-1","v":0},{"$f":"Tabelle2[[#This Row],[Menge\n    *)]]*-1","v":0},"X","X","X","X"]
[null,null,null,null,"651G6031",0,"GRAFENTHAL SSD 1600GB NVME ENTERPRISE","READ 3100MB/S WRITE 2350MB/S 32GT/S","PCI EXPRESS 3.0",null,null,null,"X","X","X","X","X","X","X","X","X","X","X","X",{"$f":"Tabelle2[[#This Row],[Menge\n    *)]]*-1","v":0},{"$f":"Tabelle2[[#This Row],[Menge\n    *)]]*-1","v":0},"X","X","X","X"]
[null,null,null,null,"651G6032",0,"GRAFENTHAL SSD 3200GB NVME ENTERPRISE","READ 3100MB/S WRITE 2350MB/S 32GT/S","PCI EXPRESS 3.0",null,null,null,"X","X","X","X","X","X","X","X","X","X","X","X",{"$f":"Tabelle2[[#This Row],[Menge\n    *)]]*-1","v":0},{"$f":"Tabelle2[[#This Row],[Menge\n    *)]]*-1","v":0},"X","X","X","X"]
[null,null,null,null,"DVD",{"$f":"SUM(F68:F68)","v":0}]
[null,null,null,null,"658G6002",0,"GRAFENTHAL DVD-DRIVE FOR R2108 S2"," "," ",null,null,null,"X","X","X","X","X","X","X","X","X","X","X","X","X","X","X","X",{"$f":"Tabelle2[[#This Row],[Menge\n    *)]]*-1","v":0},"X"]
[null,null,null,null,"Raid Controller",{"$f":"SUM(F70:F74)","v":0}]
[null,null,null,null,"653G5007",0,"GRAFENTHAL RAID CONTROLLER SAS/SATA","12GB/S /6GB/S 8i 1GB CACHE","RAID 0 1  5 6 10 50 60 TYP 9361-8I",null,null,null,"X","X","X","X","X","X","X","X",{"$f":"Tabelle2[[#This Row],[Menge\n    *)]]*8","v":0},{"$f":"Tabelle2[[#This Row],[Menge\n    *)]]*1","v":0},"X","X",{"$f":"Tabelle2[[#This Row],[Menge\n    *)]]*-1","v":0},{"$f":"Tabelle2[[#This Row],[Menge\n    *)]]*-1","v":0},{"$f":"Tabelle2[[#This Row],[Menge\n    *)]]*-1","v":0},"X","X","X"]
[null,null,null,null,"653G5008",0,"GRAFENTHAL RAID CONTROLLER SAS/SATA","12GB/S /6GB/S 8i NO CACHE"," ",null,null,null,null,null,null,null,null,null,null,null,{"$f":"Tabelle2[[#This Row],[Menge\n    *)]]*8","v":0},null,null,null,{"$f":"Tabelle2[[#This Row],[Menge\n    *)]]*-1","v":0},{"$f":"Tabelle2[[#This Row],[Menge\n    *)]]*-1","v":0},{"$f":"Tabelle2[[#This Row],[Menge\n    *)]]*-1","v":0}]
[null,null,null,null,"653G5007",0,"GRAFENTHAL RAID CONTROLLER SAS/SATA","12GB/S /6GB/S 8i 1GB CACHE","RAID 0 1  5 6 10 50 60 TYP 9361-8I",null,null,null,"X","X","X","X","X","X","X","X",{"$f":"Tabelle2[[#This Row],[Menge\n    *)]]*8","v":0},"X","X","X",{"$f":"Tabelle2[[#This Row],[Menge\n    *)]]*-1","v":0},{"$f":"Tabelle2[[#This Row],[Menge\n    *)]]*-1","v":0},{"$f":"Tabelle2[[#This Row],[Menge\n    *)]]*-1","v":0},"X","X","X"]
[null,null,null,null,"653G5903",0,"GRAFENTHAL CACHEVAULT FLASH CACHE","PROTECTION MODULE FOR RAID CTR"," ",null,null,null,"X","X","X","X","X","X","X","X","X","X","X","X","X","X","X","X","X","X"]
[null,null,null,null,"653G7001",0,"GRAFENTHAL MEGARAID CACHECADE PRO 2.0","PHYSICAL KEY SSD CACHE ENABLER"," "]
[null,null,null,null,"HBA SAS",{"$f":"SUM(F76:F81)","v":0}]
[null,null,null,null,"659G4013",0,"GRAFENTHAL EXTERNAL SAS CABLE 1M","MINI MULTILANE SFF-8088 TO SFF-8644"," ",null,null,null,"X","X","X","X","X","X","X","X","X","X","X","X","X","X","X","X","X","X"]
[null,null,null,null,"653G6005",0,"GRAFENTHAL HBA SAS/SATA 12Gb/s 9300-4i4e"," "," ",null,null,null,"X","X","X","X","X","X","X","X","X","X","X","X",{"$f":"Tabelle2[[#This Row],[Menge\n    *)]]*-1","v":0},{"$f":"Tabelle2[[#This Row],[Menge\n    *)]]*-1","v":0},{"$f":"Tabelle2[[#This Row],[Menge\n    *)]]*-1","v":0},"X","X","X"]
[null,null,null,null,"653G6004",0,"GRAFENTHAL HBA SAS/SATA 12Gb/s 9305-16i"," "," ",null,null,null,"X","X","X","X","X","X","X","X","X","X","X","X",{"$f":"Tabelle2[[#This Row],[Menge\n    *)]]*-1","v":0},{"$f":"Tabelle2[[#This Row],[Menge\n    *)]]*-1","v":0},{"$f":"Tabelle2[[#This Row],[Menge\n    *)]]*-1","v":0},"X","X","X"]
[null,null,null,null,"653G7005",0,"GRAFENTHAL CONTROLLER HBA SAS 9300-8E","8 PORT EXTERN MULTI LANE PCI LP BROADCOM"," ",null,null,null,null,null,null,null,null,null,null,null,null,null,null,null,{"$f":"Tabelle2[[#This Row],[Menge\n    *)]]*-1","v":0},{"$f":"Tabelle2[[#This Row],[Menge\n    *)]]*-1","v":0},{"$f":"Tabelle2[[#This Row],[Menge\n    *)]]*-1","v":0}]
[null,null,null,null,"653G7006",0,"GRAFENTHAL EXTERNAL SAS CABLE 2M","SFF-8644 TO SFF-8644"," "]
[null,null,null,null,"653G7007",0,"GRAFENTHAL EXTERNAL SAS CABLE 1M","SFF-8644 TO SFF-8644"," "]
[null,null,null,null,"(Kupfer-) Netzkarte",{"$f":"SUM(F83:F84)","v":0}]
[null,null,null,null,"653G7002",0,"GRAFENTHAL ETHERNET ADAPTER DUAL PORT","RJ45 2x10GBE X550-T2 PCIe 3.0 x4"," ",null,null,null,"X","X","X","X","X","X","X","X","X","X","X","X",{"$f":"Tabelle2[[#This Row],[Menge\n    *)]]*-1","v":0},{"$f":"Tabelle2[[#This Row],[Menge\n    *)]]*-1","v":0},{"$f":"Tabelle2[[#This Row],[Menge\n    *)]]*-1","v":0},"X","X","X"]
[null,null,null,null,"659G8015",0,"GRAFENTHAL GIGABIT ETHERNET APDATER","I350-T4V2 4x RJ-45 PCIe x4 COPPER"," ",null,null,null,"X","X","X","X","X","X","X","X","X","X","X","X",{"$f":"Tabelle2[[#This Row],[Menge\n    *)]]*-1","v":0},{"$f":"Tabelle2[[#This Row],[Menge\n    *)]]*-1","v":0},"X","X","X","X"]
[null,null,null,null,"(SFP+)Netzwerkkarte",{"$f":"SUM(F86:F87)","v":0}]
[null,null,null,null,"653G7000",0,"GRAFENTHAL ETHERNET ADAPTER DUAL PORT","QSFP+ 2x10GBE/40GBE PCIe 3.0 x8 XL710-QD"," "]
[null,null,null,null,"653G7003",0,"GRAFENTHAL ETHERNET ADAPTER 2-PORT 10GBE","INTEL X520 FIBRE SFP+ PCIe x8 LP"," "]
[null,null,null,null,"Glasfaserkarten",{"$f":"SUM(F89:F91)","v":0}]
[null,null,null,null,"659G7000",0,"GRAFENTHAL QLOGIC HBA FC SINGLE PORT","16GB/S PCIe 3.0 x8"," ",null,null,null,"X","X","X","X","X","X","X","X","X","X","X","X",{"$f":"Tabelle2[[#This Row],[Menge\n    *)]]*-1","v":0},{"$f":"Tabelle2[[#This Row],[Menge\n    *)]]*-1","v":0},{"$f":"Tabelle2[[#This Row],[Menge\n    *)]]*-1","v":0},"X","X","X"]
[null,null,null,null,"659G7001",0,"GRAFENTHAL QLOGIC HBA FC DUAL PORT","16GB/S PCIe 3.0 x8"," ",null,null,null,null,null,null,null,null,null,null,null,null,null,null,null,{"$f":"Tabelle2[[#This Row],[Menge\n    *)]]*-1","v":0},{"$f":"Tabelle2[[#This Row],[Menge\n    *)]]*-1","v":0},{"$f":"Tabelle2[[#This Row],[Menge\n    *)]]*-1","v":0}]
[null,null,null,null,"659G6003",0,"GRAFENTHAL HBA 8GBPS FC DUAL","PORT PCI-E"," ",null,null,null,"X","X","X","X","X","X","X","X","X","X","X","X",{"$f":"Tabelle2[[#This Row],[Menge\n    *)]]*-1","v":0},{"$f":"Tabelle2[[#This Row],[Menge\n    *)]]*-1","v":0},{"$f":"Tabelle2[[#This Row],[Menge\n    *)]]*-1","v":0},"X","X","X"]
[null,null,null,null,"Grafikkarte",{"$f":"SUM(#REF!)","v":{"$error":"#REF!"}}]
[null,null,null,null,"PSU",{"$f":"SUM(F94:F95)","v":0},"* zusätzliche PSUs nach CPU-Last  -  1 PSU ist base *"]
[null,null,null,null,"654G5002",0,"GRAFENTHAL 550W PLATINUM PSU","FOR RED FOR R2108 S2"," ",null,null,null,"X","X","X","X","X","X","X","X","X","X","X","X","X","X","X","X","X",{"$f":"Tabelle2[[#This Row],[Menge\n    *)]]*-1","v":0}]
[null,null,null,null,"654G5002",{"$f":"IF(AND(F15=1,NOT(F25>=1)),0,IF(OR(F15>1,F25>=1),1,0))","v":0},"GRAFENTHAL 550W PLATINUM PSU","FOR RED FOR R2108 S2"," ",null,null,null,"X","X","X","X","X","X","X","X","X","X","X","X","X","X","X","X","X",{"$f":"Tabelle2[[#This Row],[Menge\n    *)]]*-1","v":0}]
[null,null,null,null,"Betriebssysteme",{"$f":"SUM(F97:F99)","v":0}]
[null,null,null,null,"655G3002",0,"GRAFENTHAL WINDOWS SERVER 2012 R2","ESSENTIALS LIZENZ UND MEDIEN 1-2 CPU"," ",null,null,null,"X","X","X","X","X","X","X","X","X","X","X","X","X","X","X","X","X","X"]
[null,null,null,null,"655G3003",0,"GRAFENTHAL WINDOWS SERVER 2012 R2","STANDARD LIZENZ UND MEDIEN 2 CPU"," ",null,null,null,"X","X","X","X","X","X","X","X","X","X","X","X","X","X","X","X","X","X"]
[null,null,null,null,"P73-07115",0,"MICROSOFT WINDOWS SERVER 2016 STANDARD","64BIT 16C"," "]
[null,null,null,null,"Open-E",{"$f":"SUM(F101:F112)","v":0}]
[null,null,null,null,1701,0,"OPEN-E DSS V7 STORAGE SOFTWARE OS, 4TB"," ",null,null,null,null,"X","X","X","X","X","X","X","X","X","X","X",{"$f":"Tabelle2[[#This Row],[Menge\n    *)]]*-1","v":0},"X","X","X","X","X","X"]
[null,null,null,null,1702,0,"OPEN-E DSS V7 STORAGE SOFTWARE OS, 8TB"," ",null,null,null,null,"X","X","X","X","X","X","X","X","X","X","X",{"$f":"Tabelle2[[#This Row],[Menge\n    *)]]*-1","v":0},"X","X","X","X","X","X"]
[null,null,null,null,1703,0,"OPEN-E DSS V7 STORAGE SOFTWARE OS, 16TB"," ",null,null,null,null,"X","X","X","X","X","X","X","X","X","X","X",{"$f":"Tabelle2[[#This Row],[Menge\n    *)]]*-1","v":0},"X","X","X","X","X","X"]
[null,null,null,null,1704,0,"OPEN-E DSS V7 STORAGE SOFTWARE OS,","UNLIMITED TB",null,null,null,null,"X","X","X","X","X","X","X","X","X","X","X",{"$f":"Tabelle2[[#This Row],[Menge\n    *)]]*-1","v":0},"X","X","X","X","X","X"]
[null,null,null,null,1719,0,"OPEN-E FEATURE PACK-ACTIVE iSCSI,","FAILOVER V7 ONLY TWO LICENSE KEY",null,null,null,null,"X","X","X","X","X","X","X","X","X","X","X",{"$f":"Tabelle2[[#This Row],[Menge\n    *)]]*-1","v":0},"X","X","X","X","X","X"]
[null,null,null,null,1775,0,"OPEN-E STANDARD SUPPORT, 1 YEAR,","8 BUSINESS HR PHONE OR EMAIL",null,null,null,null,"X","X","X","X","X","X","X","X","X","X","X",{"$f":"Tabelle2[[#This Row],[Menge\n    *)]]*-1","v":0},"X","X","X","X","X","X"]
[null,null,null,null,1776,0,"OPEN-E PREMIUM SUPPORT, 1 YEAR","4 BUSINESS HR PHONE EMAIL REMOTE CONSOLE",null,null,null,null,"X","X","X","X","X","X","X","X","X","X","X",{"$f":"Tabelle2[[#This Row],[Menge\n    *)]]*-1","v":0},"X","X","X","X","X","X"]
[null,null,null,null,1777,0,"OPEN-E 24/7 SUPPORT,3 YEARS,4 BUSI. HR.","UP TO 4H AFTER SUBMISSION OF TICKET",null,null,null,null,"X","X","X","X","X","X","X","X","X","X","X",{"$f":"Tabelle2[[#This Row],[Menge\n    *)]]*-1","v":0},"X","X","X","X","X","X"]
[null,null,null,null,1778,0,"OPEN-E UPGRADE TO 3 YEARS BASIC SUPPORT"," ",null,null,null,null,"X","X","X","X","X","X","X","X","X","X","X",{"$f":"Tabelle2[[#This Row],[Menge\n    *)]]*-1","v":0},"X","X","X","X","X","X"]
[null,null,null,null,1779,0,"OPEN-E UPGRADE TO 3 YEARS STANDARD","SUPPORT",null,null,null,null,"X","X","X","X","X","X","X","X","X","X","X",{"$f":"Tabelle2[[#This Row],[Menge\n    *)]]*-1","v":0},"X","X","X","X","X","X"]
[null,null,null,null,1780,0,"OPEN-E UPGRADE TO 3 YEARS PREMIUM","SUPPORT",null,null,null,null,"X","X","X","X","X","X","X","X","X","X","X",{"$f":"Tabelle2[[#This Row],[Menge\n    *)]]*-1","v":0},"X","X","X","X","X","X"]
[null,null,null,null,1781,0,"OPEN-E 24/7 SUPPORT,3 YEARS,4 BUSI. HR.","UP TO 4H AFTER SUBMISSION OF TICKET",null,null,null,null,"X","X","X","X","X","X","X","X","X","X","X",{"$f":"Tabelle2[[#This Row],[Menge\n    *)]]*-1","v":0},"X","X","X","X","X","X"]
[null,null,null,null,"MPAC",{"$f":"SUM(F114:F149)","v":0}]
[null,null,null,null,"740M6019",0,"GRAFENTHAL MPAC VOR ORT SERVICE UPGRADE","3JAHRE 13x5 24STD  WIEDERHERSTELLUNG FÜR","GRAFENTHAL SERVER R2108 S2 AB E5-2650",null,null,null,"X","X","X","X","X","X","X","X","X","X","X","X","X","X","X","X","X","X"]
[null,null,null,null,"740M6020",0,"GRAFENTHAL MPAC VOR ORT SERVICE UPGRADE","3JAHRE 13x5 12STD  WIEDERHERSTELLUNG FÜR","GRAFENTHAL SERVER R2108 S2 AB E5-2650",null,null,null,"X","X","X","X","X","X","X","X","X","X","X","X","X","X","X","X","X","X"]
[null,null,null,null,"740M6021",0,"GRAFENTHAL MPAC VOR ORT SERVICE UPGRADE","3JAHRE 24x7 6 STD  WIEDERHERSTELLUNG FÜR","GRAFENTHAL SERVER R2108 S2 AB E5-2650",null,null,null,"X","X","X","X","X","X","X","X","X","X","X","X","X","X","X","X","X","X"]
[null,null,null,null,"740M6022",0,"GRAFENTHAL MPAC VOR ORT SERVICE UPGRADE","4JAHRE 13x5 24STD  WIEDERHERSTELLUNG FÜR","GRAFENTHAL SERVER R2108 S2 AB E5-2650",null,null,null,"X","X","X","X","X","X","X","X","X","X","X","X","X","X","X","X","X","X"]
[null,null,null,null,"740M6023",0,"GRAFENTHAL MPAC VOR ORT SERVICE UPGRADE","4JAHRE 13x5 12STD  WIEDERHERSTELLUNG FÜR","GRAFENTHAL SERVER R2108 S2 AB E5-2650",null,null,null,"X","X","X","X","X","X","X","X","X","X","X","X","X","X","X","X","X","X"]
[null,null,null,null,"740M6024",0,"GRAFENTHAL MPAC VOR ORT SERVICE UPGRADE","4JAHRE 24x7 6 STD  WIEDERHERSTELLUNG FÜR","GRAFENTHAL SERVER R2108 S2 AB E5-2650",null,null,null,"X","X","X","X","X","X","X","X","X","X","X","X","X","X","X","X","X","X"]
[null,null,null,null,"740M6025",0,"GRAFENTHAL MPAC VOR ORT SERVICE UPGRADE","5JAHRE 13x5 24STD  WIEDERHERSTELLUNG FÜR","GRAFENTHAL SERVER R2108 S2 AB E5-2650",null,null,null,"X","X","X","X","X","X","X","X","X","X","X","X","X","X","X","X","X","X"]
[null,null,null,null,"740M6026",0,"GRAFENTHAL MPAC VOR ORT SERVICE UPGRADE","5JAHRE 13x5 12STD  WIEDERHERSTELLUNG FÜR","GRAFENTHAL SERVER R2108 S2 AB E5-2650",null,null,null,"X","X","X","X","X","X","X","X","X","X","X","X","X","X","X","X","X","X"]
[null,null,null,null,"740M6027",0,"GRAFENTHAL MPAC VOR ORT SERVICE UPGRADE","5JAHRE 24x7 6 STD  WIEDERHERSTELLUNG FÜR","GRAFENTHAL SERVER R2108 S2 AB E5-2650",null,null,null,"X","X","X","X","X","X","X","X","X","X","X","X","X","X","X","X","X","X"]
[null,null,null,null,"740M6070",0,"GRAFENTHAL MPAC VOR ORT SERVICE UPGRADE","3JAHRE 13x5 24STD  WIEDERHERSTELLUNG DMR","GRAFENTHAL SERVER R2108 S2 AB E5-2650",null,null,null,"X","X","X","X","X","X","X","X","X","X","X","X","X","X","X","X","X","X"]
[null,null,null,null,"740M6071",0,"GRAFENTHAL MPAC VOR ORT SERVICE UPGRADE","3JAHRE 13x5 12STD  WIEDERHERSTELLUNG DMR","GRAFENTHAL SERVER R2108 S2 AB E5-2650",null,null,null,"X","X","X","X","X","X","X","X","X","X","X","X","X","X","X","X","X","X"]
[null,null,null,null,"740M6072",0,"GRAFENTHAL MPAC VOR ORT SERVICE UPGRADE","3JAHRE 24x7 6 STD  WIEDERHERSTELLUNG DMR","GRAFENTHAL SERVER R2108 S2 AB E5-2650",null,null,null,"X","X","X","X","X","X","X","X","X","X","X","X","X","X","X","X","X","X"]
[null,null,null,null,"740M6073",0,"GRAFENTHAL MPAC VOR ORT SERVICE UPGRADE","4JAHRE 13x5 24STD  WIEDERHERSTELLUNG DMR","GRAFENTHAL SERVER R2108 S2 AB E5-2650",null,null,null,"X","X","X","X","X","X","X","X","X","X","X","X","X","X","X","X","X","X"]
[null,null,null,null,"740M6074",0,"GRAFENTHAL MPAC VOR ORT SERVICE UPGRADE","4JAHRE 13x5 12STD  WIEDERHERSTELLUNG DMR","GRAFENTHAL SERVER R2108 S2 AB E5-2650",null,null,null,"X","X","X","X","X","X","X","X","X","X","X","X","X","X","X","X","X","X"]
[null,null,null,null,"740M6075",0,"GRAFENTHAL MPAC VOR ORT SERVICE UPGRADE","4JAHRE 24x7 6 STD  WIEDERHERSTELLUNG DMR","GRAFENTHAL SERVER R2108 S2 AB E5-2650",null,null,null,"X","X","X","X","X","X","X","X","X","X","X","X","X","X","X","X","X","X"]
[null,null,null,null,"740M6076",0,"GRAFENTHAL MPAC VOR ORT SERVICE UPGRADE","5JAHRE 13x5 24STD  WIEDERHERSTELLUNG DMR","GRAFENTHAL SERVER R2108 S2 AB E5-2650",null,null,null,"X","X","X","X","X","X","X","X","X","X","X","X","X","X","X","X","X","X"]
[null,null,null,null,"740M6077",0,"GRAFENTHAL MPAC VOR ORT SERVICE UPGRADE","5JAHRE 13x5 12STD  WIEDERHERSTELLUNG DMR","GRAFENTHAL SERVER R2108 S2 AB E5-2650",null,null,null,"X","X","X","X","X","X","X","X","X","X","X","X","X","X","X","X","X","X"]
[null,null,null,null,"740M6078",0,"GRAFENTHAL MPAC VOR ORT SERVICE UPGRADE","5JAHRE 24x7 6 STD  WIEDERHERSTELLUNG DMR","GRAFENTHAL SERVER R2108 S2 AB E5-2650",null,null,null,"X","X","X","X","X","X","X","X","X","X","X","X","X","X","X","X","X","X"]
[null,null,null,null,"740M6010",0,"GRAFENTHAL MPAC VOR ORT SERVICE UPGRADE","3JAHRE 13x5 24STD  WIEDERHERSTELLUNG FÜR","GRAFENTHAL SERVER R2108 S2 BIS E5-264X",null,null,null,"X","X","X","X","X","X","X","X","X","X","X","X","X","X","X","X","X","X"]
[null,null,null,null,"740M6011",0,"GRAFENTHAL MPAC VOR ORT SERVICE UPGRADE","3JAHRE 13x5 12STD  WIEDERHERSTELLUNG FÜR","GRAFENTHAL SERVER R2108 S2 BIS E5-264X",null,null,null,"X","X","X","X","X","X","X","X","X","X","X","X","X","X","X","X","X","X"]
[null,null,null,null,"740M6012",0,"GRAFENTHAL MPAC VOR ORT SERVICE UPGRADE","3JAHRE 24x7 6 STD  WIEDERHERSTELLUNG FÜR","GRAFENTHAL SERVER R2108 S2 BIS E5-264X",null,null,null,"X","X","X","X","X","X","X","X","X","X","X","X","X","X","X","X","X","X"]
[null,null,null,null,"740M6013",0,"GRAFENTHAL MPAC VOR ORT SERVICE UPGRADE","4JAHRE 13x5 24STD  WIEDERHERSTELLUNG FÜR","GRAFENTHAL SERVER R2108 S2 BIS E5-264X",null,null,null,"X","X","X","X","X","X","X","X","X","X","X","X","X","X","X","X","X","X"]
[null,null,null,null,"740M6014",0,"GRAFENTHAL MPAC VOR ORT SERVICE UPGRADE","4JAHRE 13x5 12STD  WIEDERHERSTELLUNG FÜR","GRAFENTHAL SERVER R2108 S2 BIS E5-264X",null,null,null,"X","X","X","X","X","X","X","X","X","X","X","X","X","X","X","X","X","X"]
[null,null,null,null,"740M6015",0,"GRAFENTHAL MPAC VOR ORT SERVICE UPGRADE","4JAHRE 24x7 6 STD  WIEDERHERSTELLUNG FÜR","GRAFENTHAL SERVER R2108 S2 BIS E5-264X",null,null,null,"X","X","X","X","X","X","X","X","X","X","X","X","X","X","X","X","X","X"]
[null,null,null,null,"740M6016",0,"GRAFENTHAL MPAC VOR ORT SERVICE UPGRADE","5JAHRE 13x5 24STD  WIEDERHERSTELLUNG FÜR","GRAFENTHAL SERVER R2108 S2 BIS E5-264X",null,null,null,"X","X","X","X","X","X","X","X","X","X","X","X","X","X","X","X","X","X"]
[null,null,null,null,"740M6017",0,"GRAFENTHAL MPAC VOR ORT SERVICE UPGRADE","5JAHRE 13x5 12STD  WIEDERHERSTELLUNG FÜR","GRAFENTHAL SERVER R2108 S2 BIS E5-264X",null,null,null,"X","X","X","X","X","X","X","X","X","X","X","X","X","X","X","X","X","X"]
[null,null,null,null,"740M6018",0,"GRAFENTHAL MPAC VOR ORT SERVICE UPGRADE","5JAHRE 24x7 6 STD  WIEDERHERSTELLUNG FÜR","GRAFENTHAL SERVER R2108 S2 BIS E5-264X",null,null,null,"X","X","X","X","X","X","X","X","X","X","X","X","X","X","X","X","X","X"]
[null,null,null,null,"740M6061",0,"GRAFENTHAL MPAC VOR ORT SERVICE UPGRADE","3JAHRE 13x5 24STD  WIEDERHERSTELLUNG DMR","GRAFENTHAL SERVER R2108 S2 BIS E5-264X",null,null,null,"X","X","X","X","X","X","X","X","X","X","X","X","X","X","X","X","X","X"]
[null,null,null,null,"740M6062",0,"GRAFENTHAL MPAC VOR ORT SERVICE UPGRADE","3JAHRE 13x5 12STD  WIEDERHERSTELLUNG DMR","GRAFENTHAL SERVER R2108 S2 BIS E5-264X",null,null,null,"X","X","X","X","X","X","X","X","X","X","X","X","X","X","X","X","X","X"]
[null,null,null,null,"740M6063",0,"GRAFENTHAL MPAC VOR ORT SERVICE UPGRADE","3JAHRE 24x7 6 STD  WIEDERHERSTELLUNG DMR","GRAFENTHAL SERVER R2108 S2 BIS E5-264X",null,null,null,"X","X","X","X","X","X","X","X","X","X","X","X","X","X","X","X","X","X"]
[null,null,null,null,"740M6064",0,"GRAFENTHAL MPAC VOR ORT SERVICE UPGRADE","4JAHRE 13x5 24STD  WIEDERHERSTELLUNG DMR","GRAFENTHAL SERVER R2108 S2 BIS E5-264X",null,null,null,"X","X","X","X","X","X","X","X","X","X","X","X","X","X","X","X","X","X"]
[null,null,null,null,"740M6065",0,"GRAFENTHAL MPAC VOR ORT SERVICE UPGRADE","4JAHRE 13x5 12STD  WIEDERHERSTELLUNG DMR","GRAFENTHAL SERVER R2108 S2 BIS E5-264X",null,null,null,"X","X","X","X","X","X","X","X","X","X","X","X","X","X","X","X","X","X"]
[null,null,null,null,"740M6066",0,"GRAFENTHAL MPAC VOR ORT SERVICE UPGRADE","4JAHRE 24x7 6 STD  WIEDERHERSTELLUNG DMR","GRAFENTHAL SERVER R2108 S2 BIS E5-264X",null,null,null,"X","X","X","X","X","X","X","X","X","X","X","X","X","X","X","X","X","X"]
[null,null,null,null,"740M6067",0,"GRAFENTHAL MPAC VOR ORT SERVICE UPGRADE","5JAHRE 13x5 24STD  WIEDERHERSTELLUNG DMR","GRAFENTHAL SERVER R2108 S2 BIS E5-264X",null,null,null,"X","X","X","X","X","X","X","X","X","X","X","X","X","X","X","X","X","X"]
[null,null,null,null,"740M6068",0,"GRAFENTHAL MPAC VOR ORT SERVICE UPGRADE","5JAHRE 13x5 12STD  WIEDERHERSTELLUNG DMR","GRAFENTHAL SERVER R2108 S2 BIS E5-264X",null,null,null,"X","X","X","X","X","X","X","X","X","X","X","X","X","X","X","X","X","X"]
[null,null,null,null,"740M6069",0,"GRAFENTHAL MPAC VOR ORT SERVICE UPGRADE","5JAHRE 24x7 6 STD  WIEDERHERSTELLUNG DMR","GRAFENTHAL SERVER R2108 S2 BIS E5-264X",null,null,null,"X","X","X","X","X","X","X","X","X","X","X","X","X","X","X","X","X","X"]
[null,null,null,null,"CONFIG-TO-ORDER",{"$f":"SUM(F151:F154)","v":0}]
[null,null,null,null,"CTO",0,"HARDWARE ASSEMBLIERUNG",null,null,null,null,null,"X","X","X","X","X","X","X","X","X","X","X","X","X","X","X","X","X","X"]
[null,null,null,null,"CTO1",0,"HARDWARE ASSEMBLIERUNG & FIRMWARE UPDATE",null,null,null,null,null,"X","X","X","X","X","X","X","X","X","X","X","X","X","X","X","X","X","X"]
[null,null,null,null,"CTO2",0,"HARDWARE ASSEMBLIERUNG, FIRMWARE UPDATE & RAID EINRICHTUNG",null,null,null,null,null,"X","X","X","X","X","X","X","X","X","X","X","X","X","X","X","X","X","X"]
[null,null,null,null,"CTO3",0,"HARDWARE ASSEMBLIERUNG, FIRMWARE UPDATE, RAID EINRICHTUNG & OS INSTALLATION",null,null,null,null,null,"X","X","X","X","X","X","X","X","X","X","X","X","X","X","X","X","X","X"]
[null,null,null,null,"USB Drive",{"$f":"SUM(F156)","v":0}]
[null,null,null,null,"652G6004",0,"GRAFENTHAL USB 3.0 FLASH DRIVE","ULTRA FIT 64GB UP TO 150MB/S"," ",null,null,null,"X","X","X","X","X","X","X","X","X","X","X","X","X","X","X","X","X","X"]
[null,null,null,null,"USV- Systeme",{"$f":"SUM(F158:F161)","v":0}]
[null,null,null,null,"132G0150",0,"GRAFENTHAL USV ETR-1500 TOWER RACK LINE","INTERACTIVE 1500VA 1200W PURE SINEWAVE","ECO MODE 23KG CE ROHS GERMAN",null,null,null,"X","X","X","X","X","X","X","X","X","X","X","X","X","X","X","X","X","X"]
[null,null,null,null,"132G0300",0,"GRAFENTHAL USV ETR-3000 TOWER RACK LINE","INTERACTIVE 3000VA 2400W PURE SINEWAVE","ECO MODE 35KG CE ROHS GERMAN",null,null,null,"X","X","X","X","X","X","X","X","X","X","X","X","X","X","X","X","X","X"]
[null,null,null,null,"113G1150",0,"GRAFENTHAL USV PR-1500-HS PROGRAMMABLE","ECO MODE RACK MOUNT 2U USB RS232 LCD"," ",null,null,null,"X","X","X","X","X","X","X","X","X","X","X","X","X","X","X","X","X","X"]
[null,null,null,null,"113G1300",0,"GRAFENTHAL USV PR-3000-HS ONLINE","ECO MODE RACK MOUNT 2U USB RS232 LCD"," ",null,null,null,"X","X","X","X","X","X","X","X","X","X","X","X","X","X","X","X","X","X"]
[null,null,null,null,"USV- Zubehör",{"$f":"SUM(F163:F164)","v":0}]
[null,null,null,null,"149G6005",0,"GRAFENTHAL USV SNMP CARD PRO S2","FOR ETR AND PR AND PTR SERIES","MULTI SERVER SHUTDOWN",null,null,null,"X","X","X","X","X","X","X","X","X","X","X","X","X","X","X","X","X","X"]
[null,null,null,null,"149G5003",0,"GRAFENTHAL USV ACCESSORY LICENSE FOR","SNMP PRO CARD FOR ETR AND PR SERIES","MULTI SERVER SHUTDOWN",null,null,null,"X","X","X","X","X","X","X","X","X","X","X","X","X","X","X","X","X","X"]
[null,null,null,null,"SUMME",1,null,null,null,{"$f":"COUNTIF($J$166:$AD$166,\"<0\")","v":0}]
[null,null,null,null,null,null,null,null,null,{"$f":"SUM(J14:J164)","v":0},0,0,0,0,0,0,0,0,0,0,0,0,0,0,0,0,0,0,0,0]

{"sheet":"R2208 S2","index":8,"n_rows":176,"n_cols":33,"rows_kept":176,"cut":false,"hidden":false,"merged":[[0,4,0,8]]}
[null,null,null,null,"2U Rackserver R2208 S2"]
[]
[null,null,null,null,null,null,null,"zwei CPU Sockets der Intel® Xeon® E5-2600 v3-Produktfamilie","more Info"]
[null,null,null,null,null,null,null,"24 DDR4-Speicher-Slots / max. 1,5TB RAM"]
[null,null,null,null,null,null,null,"redundante Platinum Netzteile"]
[null,null,null,null,null,null,null,"leistungsstarke 12-Gbit/s Backplane"]
[null,null,null,null,null,null,null,"abschließbares Front-Bezel für mehr Schutz inklusive","*) \"Menge\" filtern um Konfiguration anzuzeigen"]
[null,null,null,null,null,null,null,"erweiterbar auf bis zu 28x 2,5 Zoll HDDs bzw. SSDs","* Felder werden automatisch ausgefüllt"]
[]
[]
[null,null,null,null,"Konfigurator",null,{"$f":"'Revision Info'!B10","v":"Revision 15"}]
[null,null,null,null,"ART. NR.","Menge\n     *)","Bezeichnung","Bezeichnung II","Bezeichnung III","nicht kombinierbar","nicht konfigurierbar","CPU slots","MEM Slots","SSD Slots","HDD Slots HS 2.5","HDD Slots HS 3.5","HDD Slots HS SAS","HDD Slots HS SATA","HDD Slots NHS SAS","HDD Slots NHS SATA","SAS Ports","HDD Counter","CacheCade","Open-E","PCI x1 Slots","PCI x4 Slots","PCI x8 Slots","PCI x16 Slots","DVD Slot","PSU Slot","Bckpl Slots Front","Bckpl Slot Rear","Eth- Non Standard Slot"]
[null,null,null,null,"Maschinentyp",{"$f":"SUM(F14:F14)","v":0},null,null,null,"if (Kombi);-1;0","if Menge;-1;0","(Menge x Eigenschaft)","(Menge x Eigenschaft)","(Menge x Eigenschaft)","(Menge x Eigenschaft)","(Menge x Eigenschaft)","(Menge x Eigenschaft)","(Menge x Eigenschaft)","(Menge x Eigenschaft)","(Menge x Eigenschaft)","(Menge x Eigenschaft)","(Menge x Eigenschaft)","(Menge x Eigenschaft)","(Menge x Eigenschaft)","(Menge x Eigenschaft)","(Menge x Eigenschaft)","(Menge x Eigenschaft)","(Menge x Eigenschaft)","(Menge x Eigenschaft)","(Menge x Eigenschaft)","(Menge x Eigenschaft)","(Menge x Eigenschaft)","(Menge x Eigenschaft)"]
[null,null,null,null,"612G5201",0,"GRAFENTHAL CTO RACK SERVER 2U R2208 S2","2x E5-2600 V4 SOCKETS 8x2,5'' BAYS","MAX 24xDIMMS 2xNIC-I3501/2 800W PSU",null,null,{"$f":"Tabelle4[[#This Row],[Menge\n     *)]]*2","v":0},{"$f":"Tabelle4[[#This Row],[Menge\n     *)]]*0","v":0},{"$f":"Tabelle4[[#This Row],[Menge\n     *)]]*0","v":0},{"$f":"Tabelle4[[#This Row],[Menge\n     *)]]*0","v":0},{"$f":"Tabelle4[[#This Row],[Menge\n     *)]]*0","v":0},{"$f":"Tabelle4[[#This Row],[Menge\n     *)]]*0","v":0},{"$f":"Tabelle4[[#This Row],[Menge\n     *)]]*0","v":0},{"$f":"Tabelle4[[#This Row],[Menge\n     *)]]*0","v":0},{"$f":"Tabelle4[[#This Row],[Menge\n     *)]]*0","v":0},{"$f":"Tabelle4[[#This Row],[Menge\n     *)]]*0","v":0},{"$f":"Tabelle4[[#This Row],[Menge\n     *)]]*8","v":0},{"$f":"Tabelle4[[#This Row],[Menge\n     *)]]*0","v":0},{"$f":"Tabelle4[[#This Row],[Menge\n     *)]]*0","v":0},{"$f":"Tabelle4[[#This Row],[Menge\n     *)]]*0","v":0},{"$f":"Tabelle4[[#This Row],[Menge\n     *)]]*0","v":0},{"$f":"Tabelle4[[#This Row],[Menge\n     *)]]*0","v":0},{"$f":"Tabelle4[[#This Row],[Menge\n     *)]]*0","v":0},{"$f":"Tabelle4[[#This Row],[Menge\n     *)]]*1","v":0},{"$f":"Tabelle4[[#This Row],[Menge\n     *)]]*2","v":0},{"$f":"Tabelle4[[#This Row],[Menge\n     *)]]*2","v":0},{"$f":"Tabelle4[[#This Row],[Menge\n     *)]]*1","v":0},{"$f":"Tabelle4[[#This Row],[Menge\n     *)]]*0","v":0}]
[null,null,null,null,"Prozessor",{"$f":"SUM(F16,F18:F28)","v":0}]
[null,null,null,null,"656G6002",0,"GRAFENTHAL CPU XEON E5-2603 V3 6CORE","1,6GHz LGA2011V3 15MB CACHE 6 THREADS"," ",{"$f":"IF(COUNTIF($F$16,\"<>0\")+COUNTIF($F$18:$F$27,\"<>0\")>1,-1,0)","v":0},null,{"$f":"Tabelle4[[#This Row],[Menge\n     *)]]*-1","v":0},{"$f":"Tabelle4[[#This Row],[Menge\n     *)]]*12","v":0},"X","X","X","X","X","X","X","X","X","X",{"$f":"Tabelle4[[#This Row],[Menge\n     *)]]*1","v":0},{"$f":"Tabelle4[[#This Row],[Menge\n     *)]]*2","v":0},{"$f":"Tabelle4[[#This Row],[Menge\n     *)]]*2","v":0},{"$f":"Tabelle4[[#This Row],[Menge\n     *)]]*2","v":0},{"$f":"Tabelle4[[#This Row],[Menge\n     *)]]*1","v":0},"X","X","X","X",{"$f":"Tabelle4[[#This Row],[Menge\n     *)]]*0.5","v":0}]
[null,null,null,null,"V4 Prozessoren",{"$f":"SUM(F18:F28)","v":0}]
[null,null,null,null,"656G6016",0,"GRAFENTHAL CPU XEON E5-2637 V4 4CORE","3,5Ghz LGA2011V3 15MB CACHE 8 THREADS"," ",null,null,{"$f":"Tabelle4[[#This Row],[Menge\n     *)]]*-1","v":0},{"$f":"Tabelle4[[#This Row],[Menge\n     *)]]*12","v":0},"X","X","X","X","X","X","X","X","X","X","X",{"$f":"Tabelle4[[#This Row],[Menge\n     *)]]*2","v":0},{"$f":"Tabelle4[[#This Row],[Menge\n     *)]]*2","v":0},{"$f":"Tabelle4[[#This Row],[Menge\n     *)]]*2","v":0},{"$f":"Tabelle4[[#This Row],[Menge\n     *)]]*1","v":0},"X","X","X","X",{"$f":"Tabelle4[[#This Row],[Menge\n     *)]]*0.5","v":0}]
[null,null,null,null,"656G6017",0,"GRAFENTHAL CPU XEON E5-2603 V4 6CORE","1,7Ghz LGA2011V3 15MB CACHE 6 THREADS"," ",null,null,{"$f":"Tabelle4[[#This Row],[Menge\n     *)]]*-1","v":0},{"$f":"Tabelle4[[#This Row],[Menge\n     *)]]*12","v":0},"X","X","X","X","X","X","X","X","X","X","X",{"$f":"Tabelle4[[#This Row],[Menge\n     *)]]*2","v":0},{"$f":"Tabelle4[[#This Row],[Menge\n     *)]]*2","v":0},{"$f":"Tabelle4[[#This Row],[Menge\n     *)]]*2","v":0},{"$f":"Tabelle4[[#This Row],[Menge\n     *)]]*1","v":0},"X","X","X","X",{"$f":"Tabelle4[[#This Row],[Menge\n     *)]]*0.5","v":0}]
[null,null,null,null,"656G6018",0,"GRAFENTHAL CPU XEON E5-2609 V4 8CORE","1,7Ghz LGA2011V3 20MB CACHE 8 THREADS"," ",null,null,{"$f":"Tabelle4[[#This Row],[Menge\n     *)]]*-1","v":0},{"$f":"Tabelle4[[#This Row],[Menge\n     *)]]*12","v":0},"X","X","X","X","X","X","X","X","X","X","X",{"$f":"Tabelle4[[#This Row],[Menge\n     *)]]*2","v":0},{"$f":"Tabelle4[[#This Row],[Menge\n     *)]]*2","v":0},{"$f":"Tabelle4[[#This Row],[Menge\n     *)]]*2","v":0},{"$f":"Tabelle4[[#This Row],[Menge\n     *)]]*1","v":0},"X","X","X","X",{"$f":"Tabelle4[[#This Row],[Menge\n     *)]]*0.5","v":0}]
[null,null,null,null,"656G6019",0,"GRAFENTHAL CPU XEON E5-2620 V4 8CORE","2,1GHz LGA2011V3 20MB CACHE 16 THREADS"," ",null,null,{"$f":"Tabelle4[[#This Row],[Menge\n     *)]]*-1","v":0},{"$f":"Tabelle4[[#This Row],[Menge\n     *)]]*12","v":0},"X","X","X","X","X","X","X","X","X","X","X",{"$f":"Tabelle4[[#This Row],[Menge\n     *)]]*2","v":0},{"$f":"Tabelle4[[#This Row],[Menge\n     *)]]*2","v":0},{"$f":"Tabelle4[[#This Row],[Menge\n     *)]]*2","v":0},{"$f":"Tabelle4[[#This Row],[Menge\n     *)]]*1","v":0},"X","X","X","X",{"$f":"Tabelle4[[#This Row],[Menge\n     *)]]*0.5","v":0}]
[null,null,null,null,"656G6020",0,"GRAFENTHAL CPU XEON E5-2630v4 2.20GHz","10C 25MB 85W"," ",null,null,{"$f":"Tabelle4[[#This Row],[Menge\n     *)]]*-1","v":0},{"$f":"Tabelle4[[#This Row],[Menge\n     *)]]*12","v":0},"X","X","X","X","X","X","X","X","X","X","X",{"$f":"Tabelle4[[#This Row],[Menge\n     *)]]*2","v":0},{"$f":"Tabelle4[[#This Row],[Menge\n     *)]]*2","v":0},{"$f":"Tabelle4[[#This Row],[Menge\n     *)]]*2","v":0},{"$f":"Tabelle4[[#This Row],[Menge\n     *)]]*1","v":0},"X","X","X","X",{"$f":"Tabelle4[[#This Row],[Menge\n     *)]]*0.5","v":0}]
[null,null,null,null,"656G6021",0,"GRAFENTHAL CPU XEON E5-2640 V4 10CORE","2,4Ghz LGA2011V3 25MB CACHE 20 THREADS"," ",null,null,{"$f":"Tabelle4[[#This Row],[Menge\n     *)]]*-1","v":0},{"$f":"Tabelle4[[#This Row],[Menge\n     *)]]*12","v":0},"X","X","X","X","X","X","X","X","X","X","X",{"$f":"Tabelle4[[#This Row],[Menge\n     *)]]*2","v":0},{"$f":"Tabelle4[[#This Row],[Menge\n     *)]]*2","v":0},{"$f":"Tabelle4[[#This Row],[Menge\n     *)]]*2","v":0},{"$f":"Tabelle4[[#This Row],[Menge\n     *)]]*1","v":0},"X","X","X","X",{"$f":"Tabelle4[[#This Row],[Menge\n     *)]]*0.5","v":0}]
[null,null,null,null,"656G6022",0,"GRAFENTHAL CPU XEON E5-2650 V4 12CORE","2,2Ghz LGA2011V3 30MB CACHE 24 THREADS"," ",null,null,{"$f":"Tabelle4[[#This Row],[Menge\n     *)]]*-1","v":0},{"$f":"Tabelle4[[#This Row],[Menge\n     *)]]*12","v":0},"X","X","X","X","X","X","X","X","X","X","X",{"$f":"Tabelle4[[#This Row],[Menge\n     *)]]*2","v":0},{"$f":"Tabelle4[[#This Row],[Menge\n     *)]]*2","v":0},{"$f":"Tabelle4[[#This Row],[Menge\n     *)]]*2","v":0},{"$f":"Tabelle4[[#This Row],[Menge\n     *)]]*1","v":0},"X","X","X","X",{"$f":"Tabelle4[[#This Row],[Menge\n     *)]]*0.5","v":0}]
[null,null,null,null,"656G6023",0,"GRAFENTHAL CPU XEON E5-2660 V4 14CORE","2,0Ghz LGA2011V3 35MB CACHE 28 THREADS"," ",null,null,{"$f":"Tabelle4[[#This Row],[Menge\n     *)]]*-1","v":0},{"$f":"Tabelle4[[#This Row],[Menge\n     *)]]*12","v":0},"X","X","X","X","X","X","X","X","X","X","X",{"$f":"Tabelle4[[#This Row],[Menge\n     *)]]*2","v":0},{"$f":"Tabelle4[[#This Row],[Menge\n     *)]]*2","v":0},{"$f":"Tabelle4[[#This Row],[Menge\n     *)]]*2","v":0},{"$f":"Tabelle4[[#This Row],[Menge\n     *)]]*1","v":0},"X","X","X","X",{"$f":"Tabelle4[[#This Row],[Menge\n     *)]]*0.5","v":0}]
[null,null,null,null,"656G6024",0,"GRAFENTHAL CPU XEON E5-2680 V4 14CORE","2,40GHz LGA2011 35MB CACHE 28 THREADS"," ",null,null,{"$f":"Tabelle4[[#This Row],[Menge\n     *)]]*-1","v":0},{"$f":"Tabelle4[[#This Row],[Menge\n     *)]]*12","v":0},"X","X","X","X","X","X","X","X","X","X","X",{"$f":"Tabelle4[[#This Row],[Menge\n     *)]]*2","v":0},{"$f":"Tabelle4[[#This Row],[Menge\n     *)]]*2","v":0},{"$f":"Tabelle4[[#This Row],[Menge\n     *)]]*2","v":0},{"$f":"Tabelle4[[#This Row],[Menge\n     *)]]*1","v":0},"X","X","X","X",{"$f":"Tabelle4[[#This Row],[Menge\n     *)]]*0.5","v":0}]
[null,null,null,null,"656G6026",0,"GRAFENTHAL CPU XEON E5-2687W V4 12CORE","3.00GHz LGA2011 30MB CACHE 24 THREADS"," ",null,null,{"$f":"Tabelle4[[#This Row],[Menge\n     *)]]*-1","v":0},{"$f":"Tabelle4[[#This Row],[Menge\n     *)]]*12","v":0},"X","X","X","X","X","X","X","X","X","X","X",{"$f":"Tabelle4[[#This Row],[Menge\n     *)]]*2","v":0},{"$f":"Tabelle4[[#This Row],[Menge\n     *)]]*2","v":0},{"$f":"Tabelle4[[#This Row],[Menge\n     *)]]*2","v":0},{"$f":"Tabelle4[[#This Row],[Menge\n     *)]]*1","v":0},"X","X","X","X",{"$f":"Tabelle4[[#This Row],[Menge\n     *)]]*0.5","v":0}]
[null,null,null,null,"656G6025",0,"GRAFENTHAL CPU XEON E5-2690 V4 14CORE","2,6Ghz LGA2011V3 35MB CACHE 28 THREADS"," ",null,null,{"$f":"Tabelle4[[#This Row],[Menge\n     *)]]*-1","v":0},{"$f":"Tabelle4[[#This Row],[Menge\n     *)]]*12","v":0},"X","X","X","X","X","X","X","X","X","X","X",{"$f":"Tabelle4[[#This Row],[Menge\n     *)]]*2","v":0},{"$f":"Tabelle4[[#This Row],[Menge\n     *)]]*2","v":0},{"$f":"Tabelle4[[#This Row],[Menge\n     *)]]*2","v":0},{"$f":"Tabelle4[[#This Row],[Menge\n     *)]]*1","v":0},"X","X","X","X",{"$f":"Tabelle4[[#This Row],[Menge\n     *)]]*0.5","v":0}]
[null,null,null,null,"Heatsink",{"$f":"SUM(F30)","v":0}]
[null,null,null,null,"659G6015",{"$f":"IF(OR(SUM(F16:F16)>0,SUM(F18:F28)>0),SUM(F16:F16)+SUM(F18:F28)*1,0)","v":0},"GRAFENTHAL CPU COOLER FOR R2208 S2"," "," ",null,null,null,"X","X","X","X","X","X","X","X","X","X","X","X","X","X","X","X","X","X","X","X"]
[null,null,null,null,"Arbeitsspeicher",{"$f":"SUM(F32:F36)","v":0}]
[null,null,null,null,"652G6009",0,"GRAFENTHAL MEM 8GB DDR4-2400MHz RDIMM","PC4-19200 CL17 DUAL RANKED ECC"," ",null,null,null,{"$f":"Tabelle4[[#This Row],[Menge\n     *)]]*-1","v":0},"X","X","X","X","X","X","X","X","X","X","X","X","X","X","X","X","X","X","X"]
[null,null,null,null,"652G7000",0,"GRAFENTHAL MEM 16GB DDR4 2400MHz RDIMM","PC4-19200 CL17 DUAL RANKED ECC"," ",null,null,null,{"$f":"Tabelle4[[#This Row],[Menge\n     *)]]*-1","v":0}]
[null,null,null,null,"652G7001",0,"GRAFENTHAL MEM 16GB DDR4 2400MHz LRDIMM","PC4-19200L CL17 DUAL RANKED ECC"," ",null,null,null,{"$f":"Tabelle4[[#This Row],[Menge\n     *)]]*-1","v":0},"X","X","X","X","X","X","X","X","X","X","X","X","X","X","X","X","X","X","X"]
[null,null,null,null,"652G6011",0,"GRAFENTHAL MEM 32GB DDR4-2400MHz RDIMM","PC4-19200 CL17 DUAL RANKED ECC"," ",null,null,null,{"$f":"Tabelle4[[#This Row],[Menge\n     *)]]*-1","v":0},"X","X","X","X","X","X","X","X","X","X","X","X","X","X","X","X","X","X","X"]
[null,null,null,null,"652G7002",0,"GRAFENTHAL MEM 32GB DDR4 2400MHz LRDIMM","PC4-19200L CL17 DUAL RANKED ECC"," ",null,null,null,{"$f":"Tabelle4[[#This Row],[Menge\n     *)]]*-1","v":0}]
[null,null,null,null,"HDD Expansion",{"$f":"SUM(F38:F42)","v":0}]
[null,null,null,null,"659G5003",0,"GRAFENTHAL HDD EXPANSION KIT 8x2,5''","FRONT SAS/SATA BACKPLANE","CARRIER FOR R2208 GEN2",null,null,null,"X",{"$f":"Tabelle4[[#This Row],[Menge\n     *)]]*8","v":0},{"$f":"Tabelle4[[#This Row],[Menge\n     *)]]*8","v":0},"X",{"$f":"Tabelle4[[#This Row],[Menge\n     *)]]*8","v":0},{"$f":"Tabelle4[[#This Row],[Menge\n     *)]]*8","v":0},"X","X",{"$f":"Tabelle4[[#This Row],[Menge\n     *)]]*-2","v":0},{"$f":"Tabelle4[[#This Row],[Menge\n     *)]]*8","v":0},"X","X","X","X","X","X","X","X",{"$f":"Tabelle4[[#This Row],[Menge\n     *)]]*-1","v":0},"X"]
[null,null,null,null,"639G5004",0,"GRAFENTHAL HDD EXPANSION KIT 2x2,5''","REAR SAS/SATA BACKPLANE","R2208 S2",null,null,null,"X",{"$f":"Tabelle4[[#This Row],[Menge\n     *)]]*2","v":0},{"$f":"Tabelle4[[#This Row],[Menge\n     *)]]*2","v":0},"X",{"$f":"Tabelle4[[#This Row],[Menge\n     *)]]*2","v":0},{"$f":"Tabelle4[[#This Row],[Menge\n     *)]]*2","v":0},"X","X",{"$f":"Tabelle4[[#This Row],[Menge\n     *)]]*-1","v":0},{"$f":"Tabelle4[[#This Row],[Menge\n     *)]]*2","v":0},"X","X","X","X","X","X","X","X","X",{"$f":"Tabelle4[[#This Row],[Menge\n     *)]]*-1","v":0}]
[null,null,null,null,"653G5009",{"$f":"IF(OR($F$38>0,$F$39>0),1,0)","v":0},"GRAFENTHAL EXPANDER CARD SAS","6GB/S SAS 12GB/S 9x MINI-SAS 4i PORTS","UPTO 28 HDDs",null,null,null,"X","X","X","X","X","X","X","X",{"$f":"Tabelle4[[#This Row],[Menge\n     *)]]*8","v":0},"X","X","X",{"$f":"Tabelle4[[#This Row],[Menge\n     *)]]*-1","v":0},{"$f":"Tabelle4[[#This Row],[Menge\n     *)]]*-1","v":0},{"$f":"Tabelle4[[#This Row],[Menge\n     *)]]*-1","v":0},"X","X","X","X","X"]
[null,null,null,null,"653G5011",{"$f":"$F$40*4+$F$39*1","v":0},"GRAFENTHAL RAID CABLE MINI-SAS HD TO","MINI-SAS SFF-8643 TO SFF-8087 0.6M"," "]
[null,null,null,null,"653G5013",{"$f":"$F$38*2","v":0},"GRAFENTHAL RAID CABLE MINI-SAS HD TO","MINI-SAS SFF-8643 TO SFF-8087 1.0M"," "]
[null,null,null,null,"Festplatten"]
[null,null,null,null,"SATA SSD 6GB/s *MIDRANGE*",{"$f":"SUM(F45:F46)","v":0}]
[null,null,null,null,"651G7011",0,"GRAFENTHAL SSD 240GB 2.5'' SATA 6GB/S","MIDRANGE 599 TBW"," ",null,null,null,"X",{"$f":"Tabelle4[[#This Row],[Menge\n     *)]]*-1","v":0},{"$f":"Tabelle4[[#This Row],[Menge\n     *)]]*-1","v":0},"X","X",{"$f":"Tabelle4[[#This Row],[Menge\n     *)]]*-1","v":0},"X","X","X",{"$f":"Tabelle4[[#This Row],[Menge\n     *)]]*-1","v":0},"X","X","X","X","X","X","X","X","X","X"]
[null,null,null,null,"651G7012",0,"GRAFENTHAL SSD 480GB 2.5'' SATA 6GB/S","MIDRANGE 945 TBW"," ",null,null,null,"X",{"$f":"Tabelle4[[#This Row],[Menge\n     *)]]*-1","v":0},{"$f":"Tabelle4[[#This Row],[Menge\n     *)]]*-1","v":0},"X","X",{"$f":"Tabelle4[[#This Row],[Menge\n     *)]]*-1","v":0},"X","X","X",{"$f":"Tabelle4[[#This Row],[Menge\n     *)]]*-1","v":0},"X","X","X","X","X","X","X","X","X","X"]
[null,null,null,null,"SATA SSD 6GB/s *ENTRY*",{"$f":"SUM(F48:F51)","v":0}]
[null,null,null,null,"651G8024",0,"GRAFENTHAL SSD 256GB SATA3 6GB/S 2.5''","MTBF 1.5M HOURS TBW 300TB"," ",null,null,null,"X",{"$f":"Tabelle4[[#This Row],[Menge\n     *)]]*-1","v":0},{"$f":"Tabelle4[[#This Row],[Menge\n     *)]]*-1","v":0},"X","X",{"$f":"Tabelle4[[#This Row],[Menge\n     *)]]*-1","v":0},"X","X","X",{"$f":"Tabelle4[[#This Row],[Menge\n     *)]]*-1","v":0},"X","X","X","X","X","X","X","X","X","X"]
[null,null,null,null,"651G8025",0,"GRAFENTHAL SSD 512GB SATA3 6GB/S 2.5''","MTBF 1.5M HOURS TBW 300TB"," ",null,null,null,"X",{"$f":"Tabelle4[[#This Row],[Menge\n     *)]]*-1","v":0},{"$f":"Tabelle4[[#This Row],[Menge\n     *)]]*-1","v":0},"X","X",{"$f":"Tabelle4[[#This Row],[Menge\n     *)]]*-1","v":0},"X","X","X",{"$f":"Tabelle4[[#This Row],[Menge\n     *)]]*-1","v":0},"X","X","X","X","X","X","X","X","X","X"]
[null,null,null,null,"651G8026",0,"GRAFENTHAL SSD 1TB SATA3 6GB/S 2.5''","MTBF 1.5M HOURS TBW 300TB"," ",null,null,null,"X",{"$f":"Tabelle4[[#This Row],[Menge\n     *)]]*-1","v":0},{"$f":"Tabelle4[[#This Row],[Menge\n     *)]]*-1","v":0},"X","X",{"$f":"Tabelle4[[#This Row],[Menge\n     *)]]*-1","v":0},"X","X","X",{"$f":"Tabelle4[[#This Row],[Menge\n     *)]]*-1","v":0},"X","X","X","X","X","X","X","X","X","X"]
[null,null,null,null,"651G8027",0,"GRAFENTHAL SSD 2TB SATA3 6GB/S 2.5''","MTBF 1.5M HOURS TBW 300TB"," ",null,null,null,"X",{"$f":"Tabelle4[[#This Row],[Menge\n     *)]]*-1","v":0},{"$f":"Tabelle4[[#This Row],[Menge\n     *)]]*-1","v":0},"X","X",{"$f":"Tabelle4[[#This Row],[Menge\n     *)]]*-1","v":0},"X","X","X",{"$f":"Tabelle4[[#This Row],[Menge\n     *)]]*-1","v":0},"X","X","X","X","X","X","X","X","X","X"]
[null,null,null,null,"SATA HDD 6GB/s",{"$f":"SUM(F53)","v":0}]
[null,null,null,null,"651G6002",0,"GRAFENTHAL HDD 1TB 2,5'' SATA 7200RPM","32MB CACHE 6GB/S BAUHÖHE 9.5MM","FUER SERVER UND WORKSTATION",null,null,null,"X","X",{"$f":"Tabelle4[[#This Row],[Menge\n     *)]]*-1","v":0},"X",{"$f":"Tabelle4[[#This Row],[Menge\n     *)]]*-1","v":0},"X","X","X","X",{"$f":"Tabelle4[[#This Row],[Menge\n     *)]]*-1","v":0},"X","X","X","X","X","X","X","X","X","X"]
[null,null,null,null,"SAS 2,5\" 10k 12GB/s",{"$f":"SUM(F55:F60)","v":0}]
[null,null,null,null,"651G8020",0,"GRAFENTHAL HDD 300GB 10K 2.5'' SAS","12GB/S"," ",null,null,null,"X","X",{"$f":"Tabelle4[[#This Row],[Menge\n     *)]]*-1","v":0},"X",{"$f":"Tabelle4[[#This Row],[Menge\n     *)]]*-1","v":0},"X","X","X","X",{"$f":"Tabelle4[[#This Row],[Menge\n     *)]]*-1","v":0},"X","X","X","X","X","X","X","X","X","X"]
[null,null,null,null,"651G8005",0,"GRAFENTHAL HDD 600GB 10K 2.5\\ SAS 12GB/S\""," "," ",null,null,null,"X","X",{"$f":"Tabelle4[[#This Row],[Menge\n     *)]]*-1","v":0},"X",{"$f":"Tabelle4[[#This Row],[Menge\n     *)]]*-1","v":0},"X","X","X","X",{"$f":"Tabelle4[[#This Row],[Menge\n     *)]]*-1","v":0},"X","X","X","X","X","X","X","X","X","X"]
[null,null,null,null,"651G8006",0,"GRAFENTHAL HDD 900GB 10K 2.5\\ SAS 12GB/S\""," "," ",null,null,null,"X","X",{"$f":"Tabelle4[[#This Row],[Menge\n     *)]]*-1","v":0},"X",{"$f":"Tabelle4[[#This Row],[Menge\n     *)]]*-1","v":0},"X","X","X","X",{"$f":"Tabelle4[[#This Row],[Menge\n     *)]]*-1","v":0},"X","X","X","X","X","X","X","X","X","X"]
[null,null,null,null,"651G8007",0,"GRAFENTHAL HDD 1.2TB 10K 2.5\\ SAS 12GB/S\""," "," ",null,null,null,"X","X",{"$f":"Tabelle4[[#This Row],[Menge\n     *)]]*-1","v":0},"X",{"$f":"Tabelle4[[#This Row],[Menge\n     *)]]*-1","v":0},"X","X","X","X",{"$f":"Tabelle4[[#This Row],[Menge\n     *)]]*-1","v":0},"X","X","X","X","X","X","X","X","X","X"]
[null,null,null,null,"651G8021",0,"GRAFENTHAL HDD 1.8TB 10K 2.5'' SAS","12GB/S"," ",null,null,null,"X","X",{"$f":"Tabelle4[[#This Row],[Menge\n     *)]]*-1","v":0},"X",{"$f":"Tabelle4[[#This Row],[Menge\n     *)]]*-1","v":0},"X","X","X","X",{"$f":"Tabelle4[[#This Row],[Menge\n     *)]]*-1","v":0},"X","X","X","X","X","X","X","X","X","X"]
[null,null,null,null,"651G8022",0,"GRAFENTHAL HDD 2.4TB 10K 2.5'' SAS","12GB/S"," ",null,null,null,"X","X",{"$f":"Tabelle4[[#This Row],[Menge\n     *)]]*-1","v":0},"X",{"$f":"Tabelle4[[#This Row],[Menge\n     *)]]*-1","v":0},"X","X","X","X",{"$f":"Tabelle4[[#This Row],[Menge\n     *)]]*-1","v":0},"X","X","X","X","X","X","X","X","X","X"]
[null,null,null,null,"SAS 2,5\" 15k 12GB/s",{"$f":"SUM(F62:F64)","v":0}]
[null,null,null,null,"651G8003",0,"GRAFENTHAL HDD 300GB 15K 2.5\\ SAS 12GB/S\""," "," ",null,null,null,"X","X",{"$f":"Tabelle4[[#This Row],[Menge\n     *)]]*-1","v":0},"X",{"$f":"Tabelle4[[#This Row],[Menge\n     *)]]*-1","v":0},"X","X","X","X",{"$f":"Tabelle4[[#This Row],[Menge\n     *)]]*-1","v":0},"X","X","X","X","X","X","X","X","X","X"]
[null,null,null,null,"651G8004",0,"GRAFENTHAL HDD 600GB 15K 2.5\\ SAS 12GB/S\""," "," ",null,null,null,"X","X",{"$f":"Tabelle4[[#This Row],[Menge\n     *)]]*-1","v":0},"X",{"$f":"Tabelle4[[#This Row],[Menge\n     *)]]*-1","v":0},"X","X","X","X",{"$f":"Tabelle4[[#This Row],[Menge\n     *)]]*-1","v":0},"X","X","X","X","X","X","X","X","X","X"]
[null,null,null,null,"651G8019",0,"GRAFENTHAL HDD 900GB 15K 2.5'' SAS","12GB/S"," ",null,null,null,"X","X",{"$f":"Tabelle4[[#This Row],[Menge\n     *)]]*-1","v":0},"X",{"$f":"Tabelle4[[#This Row],[Menge\n     *)]]*-1","v":0},"X","X","X","X",{"$f":"Tabelle4[[#This Row],[Menge\n     *)]]*-1","v":0},"X","X","X","X","X","X","X","X","X","X"]
[null,null,null,null,"SAS SSD  12GB/s *MIDRANGE*",{"$f":"SUM(F66:F69)","v":0}]
[null,null,null,null,"651G7004",0,"GRAFENTHAL SSD 480GB 2,5'' SAS 12GB/S","MIDRANGE DWPD 1"," ",null,null,null,"X",{"$f":"Tabelle4[[#This Row],[Menge\n     *)]]*-1","v":0},{"$f":"Tabelle4[[#This Row],[Menge\n     *)]]*-1","v":0},"X",{"$f":"Tabelle4[[#This Row],[Menge\n     *)]]*-1","v":0},"X","X","X","X",{"$f":"Tabelle4[[#This Row],[Menge\n     *)]]*-1","v":0},"X","X","X","X","X","X","X","X","X","X"]
[null,null,null,null,"651G7005",0,"GRAFENTHAL SSD 960GB 2,5'' SAS 12GB/S","MIDRANGE DWPD 1"," ",null,null,null,"X",{"$f":"Tabelle4[[#This Row],[Menge\n     *)]]*-1","v":0},{"$f":"Tabelle4[[#This Row],[Menge\n     *)]]*-1","v":0},null,{"$f":"Tabelle4[[#This Row],[Menge\n     *)]]*-1","v":0},"X","X","X","X",{"$f":"Tabelle4[[#This Row],[Menge\n     *)]]*-1","v":0},"X","X","X","X","X","X","X","X","X","X"]
[null,null,null,null,"651G7006",0,"GRAFENTHAL SSD 1920GB 2,5'' SAS 12GB/S","MIDRANGE DWPD 1"," ",null,null,null,"X",{"$f":"Tabelle4[[#This Row],[Menge\n     *)]]*-1","v":0},{"$f":"Tabelle4[[#This Row],[Menge\n     *)]]*-1","v":0},"X",{"$f":"Tabelle4[[#This Row],[Menge\n     *)]]*-1","v":0},"X","X","X","X",{"$f":"Tabelle4[[#This Row],[Menge\n     *)]]*-1","v":0},"X","X","X","X","X","X","X","X","X","X"]
[null,null,null,null,"651G7007",0,"GRAFENTHAL SSD 3840GB 2,5'' SAS 12GB/S","MIDRANGE DWPD 1"," ",null,null,null,null,{"$f":"Tabelle4[[#This Row],[Menge\n     *)]]*-1","v":0},{"$f":"Tabelle4[[#This Row],[Menge\n     *)]]*-1","v":0},null,{"$f":"Tabelle4[[#This Row],[Menge\n     *)]]*-1","v":0},null,null,null,null,{"$f":"Tabelle4[[#This Row],[Menge\n     *)]]*-1","v":0}]
[null,null,null,null,"SSD PCIe NVMe",{"$f":"SUM(F71:F73)","v":0}]
[null,null,null,null,"651G6030",0,"GRAFENTHAL SSD 800GB NVME ENTERPRISE","READ 3100MB/S WRITE 2350MB/S 32GT/S","PCI EXPRESS 3.0",null,null,null,"X","X","X","X","X","X","X","X","X",{"$f":"Tabelle4[[#This Row],[Menge\n     *)]]*-1","v":0},"X","X",{"$f":"Tabelle4[[#This Row],[Menge\n     *)]]*-1","v":0},{"$f":"Tabelle4[[#This Row],[Menge\n     *)]]*-1","v":0},"X","X","X","X","X","X"]
[null,null,null,null,"651G6031",0,"GRAFENTHAL SSD 1600GB NVME ENTERPRISE","READ 3100MB/S WRITE 2350MB/S 32GT/S","PCI EXPRESS 3.0",null,null,null,"X","X","X","X","X","X","X","X","X",{"$f":"Tabelle4[[#This Row],[Menge\n     *)]]*-1","v":0},"X","X",{"$f":"Tabelle4[[#This Row],[Menge\n     *)]]*-1","v":0},{"$f":"Tabelle4[[#This Row],[Menge\n     *)]]*-1","v":0},"X","X","X","X","X","X"]
[null,null,null,null,"651G6032",0,"GRAFENTHAL SSD 3200GB NVME ENTERPRISE","READ 3100MB/S WRITE 2350MB/S 32GT/S","PCI EXPRESS 3.0",null,null,null,"X","X","X","X","X","X","X","X","X",{"$f":"Tabelle4[[#This Row],[Menge\n     *)]]*-1","v":0},"X","X",{"$f":"Tabelle4[[#This Row],[Menge\n     *)]]*-1","v":0},{"$f":"Tabelle4[[#This Row],[Menge\n     *)]]*-1","v":0},"X","X","X","X","X","X"]
[null,null,null,null,"DVD",{"$f":"SUM(F75)","v":0}]
[null,null,null,null,"658G5001",0,"GRAFENTHAL DVD-DRIVE FOR R2208 S2"," "," ",null,null,null,"X","X","X","X","X","X","X","X","X","X","X","X","X","X","X","X",{"$f":"Tabelle4[[#This Row],[Menge\n     *)]]*-1","v":0},"X","X","X"]
[null,null,null,null,"Riser Card Expander",{"$f":"SUM(F77)","v":0}]
[null,null,null,null,"659G5005",0,"GRAFENTHAL PCI-E RISER CARD 3x x8-SLOTS","FOR R2208 S2"," ",null,null,null,"X","X","X","X","X","X","X","X","X","X","X","X",{"$f":"Tabelle4[[#This Row],[Menge\n     *)]]*1","v":0},{"$f":"Tabelle4[[#This Row],[Menge\n     *)]]*1","v":0},{"$f":"Tabelle4[[#This Row],[Menge\n     *)]]*1","v":0},{"$f":"Tabelle4[[#This Row],[Menge\n     *)]]*-1","v":0},"X","X","X","X"]
[null,null,null,null,"Raid Controller",{"$f":"SUM(F79:F83)","v":0},"mindestens 1 RAID Controller oder HBA benötigt"]
[null,null,null,null,"653G5007",0,"GRAFENTHAL RAID CONTROLLER SAS/SATA","12GB/S /6GB/S 8i 1GB CACHE","RAID 0 1  5 6 10 50 60 TYP 9361-8I",null,null,null,"X",{"$f":"Tabelle4[[#This Row],[Menge\n     *)]]*8","v":0},{"$f":"Tabelle4[[#This Row],[Menge\n     *)]]*8","v":0},"X",{"$f":"Tabelle4[[#This Row],[Menge\n     *)]]*8","v":0},{"$f":"Tabelle4[[#This Row],[Menge\n     *)]]*8","v":0},"X","X",{"$f":"Tabelle4[[#This Row],[Menge\n     *)]]*8","v":0},"X","X","X",{"$f":"Tabelle4[[#This Row],[Menge\n     *)]]*-1","v":0},{"$f":"Tabelle4[[#This Row],[Menge\n     *)]]*-1","v":0},{"$f":"Tabelle4[[#This Row],[Menge\n     *)]]*-1","v":0},"X","X","X","X","X"]
[null,null,null,null,"653G5008",0,"GRAFENTHAL RAID CONTROLLER SAS/SATA","12GB/S /6GB/S 8i NO CACHE"," ",null,null,null,null,{"$f":"Tabelle4[[#This Row],[Menge\n     *)]]*8","v":0},{"$f":"Tabelle4[[#This Row],[Menge\n     *)]]*8","v":0},null,{"$f":"Tabelle4[[#This Row],[Menge\n     *)]]*8","v":0},{"$f":"Tabelle4[[#This Row],[Menge\n     *)]]*8","v":0},null,null,{"$f":"Tabelle4[[#This Row],[Menge\n     *)]]*8","v":0},"X",null,null,{"$f":"Tabelle4[[#This Row],[Menge\n     *)]]*-1","v":0},{"$f":"Tabelle4[[#This Row],[Menge\n     *)]]*-1","v":0},{"$f":"Tabelle4[[#This Row],[Menge\n     *)]]*-1","v":0}]
[null,null,null,null,"653G5903",0,"GRAFENTHAL CACHEVAULT FLASH CACHE","PROTECTION MODULE FOR RAID CTR"," ",null,null,null,"X","X","X","X","X","X","X","X","X","X","X","X","X","X","X","X","X","X","X","X"]
[null,null,null,null,"658G6006",{"$f":"IF(F40=1,0,SUM(F79:F81)*2)","v":0},"GRAFENTHAL CABLE MINI SAS HD TO","MINI SAS HD"," "]
[null,null,null,null,"653G7001",0,"GRAFENTHAL MEGARAID CACHECADE PRO 2.0","PHYSICAL KEY SSD CACHE ENABLER"," "]
[null,null,null,null,"HBA SAS",{"$f":"SUM(F85:F90)","v":0}]
[null,null,null,null,"659G4013",0,"GRAFENTHAL EXTERNAL SAS CABLE 1M","MINI MULTILANE SFF-8088 TO SFF-8644"," ",null,null,null,"X","X","X","X","X","X","X","X","X","X","X","X","X","X","X","X","X","X","X","X"]
[null,null,null,null,"653G6004",0,"GRAFENTHAL HBA SAS/SATA 12Gb/s 9305-16i"," "," ",null,null,null,"X","X","X","X","X","X","X","X","X","X","X","X",{"$f":"Tabelle4[[#This Row],[Menge\n     *)]]*-1","v":0},{"$f":"Tabelle4[[#This Row],[Menge\n     *)]]*-1","v":0},{"$f":"Tabelle4[[#This Row],[Menge\n     *)]]*-1","v":0},"X","X","X","X","X"]
[null,null,null,null,"653G6005",0,"GRAFENTHAL HBA SAS/SATA 12Gb/s 9300-4i4e"," "," ",null,null,null,"X","X","X","X","X","X","X","X","X","X","X","X",{"$f":"Tabelle4[[#This Row],[Menge\n     *)]]*-1","v":0},{"$f":"Tabelle4[[#This Row],[Menge\n     *)]]*-1","v":0},{"$f":"Tabelle4[[#This Row],[Menge\n     *)]]*-1","v":0},"X","X","X","X","X"]
[null,null,null,null,"653G7005",0,"GRAFENTHAL CONTROLLER HBA SAS 9300-8E","8 PORT EXTERN MULTI LANE PCI LP BROADCOM"," ",null,null,null,null,null,null,null,null,null,null,null,null,null,null,null,{"$f":"Tabelle4[[#This Row],[Menge\n     *)]]*-1","v":0},{"$f":"Tabelle4[[#This Row],[Menge\n     *)]]*-1","v":0},{"$f":"Tabelle4[[#This Row],[Menge\n     *)]]*-1","v":0}]
[null,null,null,null,"653G7006",0,"GRAFENTHAL EXTERNAL SAS CABLE 2M","SFF-8644 TO SFF-8644"," "]
[null,null,null,null,"653G7007",0,"GRAFENTHAL EXTERNAL SAS CABLE 1M","SFF-8644 TO SFF-8644"," "]
[null,null,null,null,"(Kupfer-) Netzkarte",{"$f":"SUM(F92:F94)","v":0}]
[null,null,null,null,"653G7002",0,"GRAFENTHAL ETHERNET ADAPTER DUAL PORT","RJ45 2x10GBE X550-T2 PCIe 3.0 x4"," ",null,null,null,"X","X","X","X","X","X","X","X","X","X","X","X",{"$f":"Tabelle4[[#This Row],[Menge\n     *)]]*-1","v":0},{"$f":"Tabelle4[[#This Row],[Menge\n     *)]]*-1","v":0},{"$f":"Tabelle4[[#This Row],[Menge\n     *)]]*-1","v":0},"X","X","X","X","X"]
[null,null,null,null,"653G5006",0,"GRAFENTHAL ETHERNET CARD 2x 10GB/s","PCIe 2.0 x8 RJ-45 FOR R2208 S2"," ",null,null,null,"X","X","X","X","X","X","X","X","X","X","X","X","X","X","X","X","X","X","X","X",{"$f":"Tabelle4[[#This Row],[Menge\n     *)]]*-1","v":0}]
[null,null,null,null,"659G8015",0,"GRAFENTHAL GIGABIT ETHERNET APDATER","I350-T4V2 4x RJ-45 PCIe x4 COPPER"," ",null,null,null,"X","X","X","X","X","X","X","X","X","X","X","X",{"$f":"Tabelle4[[#This Row],[Menge\n     *)]]*-1","v":0},{"$f":"Tabelle4[[#This Row],[Menge\n     *)]]*-1","v":0},"X","X","X","X","X","X"]
[null,null,null,null,"(SFP+)Netzwerkkarte",{"$f":"SUM(F96:F97)","v":0}]
[null,null,null,null,"653G7000",0,"GRAFENTHAL ETHERNET ADAPTER DUAL PORT","QSFP+ 2x10GBE/40GBE PCIe 3.0 x8 XL710-QD"," "]
[null,null,null,null,"653G7003",0,"GRAFENTHAL ETHERNET ADAPTER 2-PORT 10GBE","INTEL X520 FIBRE SFP+ PCIe x8 LP"," "]
[null,null,null,null,"Glasfaserkarten",{"$f":"SUM(F99:F100)","v":0}]
[null,null,null,null,"659G7000",0,"GRAFENTHAL QLOGIC HBA FC SINGLE PORT","16GB/S PCIe 3.0 x8"," ",null,null,null,"X","X","X","X","X","X","X","X","X","X","X","X",{"$f":"Tabelle4[[#This Row],[Menge\n     *)]]*-1","v":0},{"$f":"Tabelle4[[#This Row],[Menge\n     *)]]*-1","v":0},{"$f":"Tabelle4[[#This Row],[Menge\n     *)]]*-1","v":0},"X","X","X","X","X"]
[null,null,null,null,"659G7001",0,"GRAFENTHAL QLOGIC HBA FC DUAL PORT","16GB/S PCIe 3.0 x8"," ",null,null,null,"X","X","X","X","X","X","X","X","X","X","X","X",{"$f":"Tabelle4[[#This Row],[Menge\n     *)]]*-1","v":0},{"$f":"Tabelle4[[#This Row],[Menge\n     *)]]*-1","v":0},{"$f":"Tabelle4[[#This Row],[Menge\n     *)]]*-1","v":0},"X","X","X","X","X"]
[null,null,null,null,"Grafikkarte",{"$f":"SUM(#REF!)","v":{"$error":"#REF!"}}]
[null,null,null,null,"PSU",{"$f":"SUM(F103:F104)","v":0}]
[null,null,null,null,"654G5001",0,"GRAFENTHAL ADDITIONAL 800W","PLATINUM PSU FOR RED FOR R2208 S2"," ",null,null,null,"X","X","X","X","X","X","X","X","X","X","X","X","X","X","X","X","X",{"$f":"Tabelle4[[#This Row],[Menge\n     *)]]*-1","v":0},"X","X"]
[null,null,null,null,"654G5001",{"$f":"IF(OR(SUM(F16:F16)>1,SUM(F18:F28)>1,F28>=1,F27>=1),1,0)","v":0},"GRAFENTHAL ADDITIONAL 800W","PLATINUM PSU FOR RED FOR R2208 S2"," ",null,null,null,"X","X","X","X","X","X","X","X","X","X","X","X","X","X","X","X","X",{"$f":"Tabelle4[[#This Row],[Menge\n     *)]]*-1","v":0},"X","X"]
[null,null,null,null,"Betriebssysteme",{"$f":"SUM(F106:F108)","v":0}]
[null,null,null,null,"655G3002",0,"GRAFENTHAL WINDOWS SERVER 2012 R2","ESSENTIALS LIZENZ UND MEDIEN 1-2 CPU"," ",null,null,null,"X","X","X","X","X","X","X","X","X","X","X","X","X","X","X","X","X","X","X","X"]
[null,null,null,null,"655G3003",0,"GRAFENTHAL WINDOWS SERVER 2012 R2","STANDARD LIZENZ UND MEDIEN 2 CPU"," ",null,null,null,"X","X","X","X","X","X","X","X","X","X","X","X","X","X","X","X","X","X","X","X"]
[null,null,null,null,"P73-07115",0,"MICROSOFT WINDOWS SERVER 2016 STANDARD","64BIT 16C"," "]
[null,null,null,null,"Open-E",{"$f":"SUM(F110:F121)","v":0}]
[null,null,null,null,1701,0,"OPEN-E DSS V7 STORAGE SOFTWARE OS, 4TB"," ",null,null,null,null,"X","X","X","X","X","X","X","X","X","X","X",{"$f":"Tabelle4[[#This Row],[Menge\n     *)]]*-1","v":0},"X","X","X","X","X","X","X","X"]
[null,null,null,null,1702,0,"OPEN-E DSS V7 STORAGE SOFTWARE OS, 8TB"," ",null,null,null,null,"X","X","X","X","X","X","X","X","X","X","X",{"$f":"Tabelle4[[#This Row],[Menge\n     *)]]*-1","v":0},"X","X","X","X","X","X","X","X"]
[null,null,null,null,1703,0,"OPEN-E DSS V7 STORAGE SOFTWARE OS, 16TB"," ",null,null,null,null,"X","X","X","X","X","X","X","X","X","X","X",{"$f":"Tabelle4[[#This Row],[Menge\n     *)]]*-1","v":0},"X","X","X","X","X","X","X","X"]
[null,null,null,null,1704,0,"OPEN-E DSS V7 STORAGE SOFTWARE OS,","UNLIMITED TB",null,null,null,null,"X","X","X","X","X","X","X","X","X","X","X",{"$f":"Tabelle4[[#This Row],[Menge\n     *)]]*-1","v":0},"X","X","X","X","X","X","X","X"]
[null,null,null,null,1719,0,"OPEN-E FEATURE PACK-ACTIVE iSCSI,","FAILOVER V7 ONLY TWO LICENSE KEY",null,null,null,null,"X","X","X","X","X","X","X","X","X","X","X",{"$f":"Tabelle4[[#This Row],[Menge\n     *)]]*-1","v":0},"X","X","X","X","X","X","X","X"]
[null,null,null,null,1775,0,"OPEN-E STANDARD SUPPORT, 1 YEAR,","8 BUSINESS HR PHONE OR EMAIL",null,null,null,null,"X","X","X","X","X","X","X","X","X","X","X",{"$f":"Tabelle4[[#This Row],[Menge\n     *)]]*-1","v":0},"X","X","X","X","X","X","X","X"]
[null,null,null,null,1776,0,"OPEN-E PREMIUM SUPPORT, 1 YEAR","4 BUSINESS HR PHONE EMAIL REMOTE CONSOLE",null,null,null,null,"X","X","X","X","X","X","X","X","X","X","X",{"$f":"Tabelle4[[#This Row],[Menge\n     *)]]*-1","v":0},"X","X","X","X","X","X","X","X"]
[null,null,null,null,1777,0,"OPEN-E 24/7 SUPPORT,3 YEARS,4 BUSI. HR.","UP TO 4H AFTER SUBMISSION OF TICKET",null,null,null,null,"X","X","X","X","X","X","X","X","X","X","X",{"$f":"Tabelle4[[#This Row],[Menge\n     *)]]*-1","v":0},"X","X","X","X","X","X","X","X"]
[null,null,null,null,1778,0,"OPEN-E UPGRADE TO 3 YEARS BASIC SUPPORT"," ",null,null,null,null,"X","X","X","X","X","X","X","X","X","X","X",{"$f":"Tabelle4[[#This Row],[Menge\n     *)]]*-1","v":0},"X","X","X","X","X","X","X","X"]
[null,null,null,null,1779,0,"OPEN-E UPGRADE TO 3 YEARS STANDARD","SUPPORT",null,null,null,null,"X","X","X","X","X","X","X","X","X","X","X",{"$f":"Tabelle4[[#This Row],[Menge\n     *)]]*-1","v":0},"X","X","X","X","X","X","X","X"]
[null,null,null,null,1780,0,"OPEN-E UPGRADE TO 3 YEARS PREMIUM","SUPPORT",null,null,null,null,"X","X","X","X","X","X","X","X","X","X","X",{"$f":"Tabelle4[[#This Row],[Menge\n     *)]]*-1","v":0},"X","X","X","X","X","X","X","X"]
[null,null,null,null,1781,0,"OPEN-E 24/7 SUPPORT,3 YEARS,4 BUSI. HR.","UP TO 4H AFTER SUBMISSION OF TICKET",null,null,null,null,"X","X","X","X","X","X","X","X","X","X","X",{"$f":"Tabelle4[[#This Row],[Menge\n     *)]]*-1","v":0},"X","X","X","X","X","X","X","X"]
[null,null,null,null,"MPAC",{"$f":"SUM(F123:F158)","v":0}]
[null,null,null,null,"740M6037",0,"GRAFENTHAL MPAC VOR ORT SERVICE UPGRADE","3JAHRE 13x5 24STD  WIEDERHERSTELLUNG","FÜR GRAFENTHAL R2208 S2 AB E5-2650",null,null,null,"X","X","X","X","X","X","X","X","X","X","X","X","X","X","X","X","X","X","X","X"]
[null,null,null,null,"740M6038",0,"GRAFENTHAL MPAC VOR ORT SERVICE UPGRADE","3JAHRE 13x5 12STD  WIEDERHERSTELLUNG FÜR","FÜR GRAFENTHAL R2208 S2 AB E5-2650",null,null,null,"X","X","X","X","X","X","X","X","X","X","X","X","X","X","X","X","X","X","X","X"]
[null,null,null,null,"740M6039",0,"GRAFENTHAL MPAC VOR ORT SERVICE UPGRADE","3JAHRE 24x7 6 STD  WIEDERHERSTELLUNG FÜR","FÜR GRAFENTHAL R2208 S2 AB E5-2650",null,null,null,"X","X","X","X","X","X","X","X","X","X","X","X","X","X","X","X","X","X","X","X"]
[null,null,null,null,"740M6040",0,"GRAFENTHAL MPAC VOR ORT SERVICE UPGRADE","4JAHRE 13x5 24STD  WIEDERHERSTELLUNG FÜR","FÜR GRAFENTHAL R2208 S2 AB E5-2650",null,null,null,"X","X","X","X","X","X","X","X","X","X","X","X","X","X","X","X","X","X","X","X"]
[null,null,null,null,"740M6041",0,"GRAFENTHAL MPAC VOR ORT SERVICE UPGRADE","4JAHRE 13x5 12STD  WIEDERHERSTELLUNG FÜR","FÜR GRAFENTHAL R2208 S2 AB E5-2650",null,null,null,"X","X","X","X","X","X","X","X","X","X","X","X","X","X","X","X","X","X","X","X"]
[null,null,null,null,"740M6042",0,"GRAFENTHAL MPAC VOR ORT SERVICE UPGRADE","4JAHRE 24x7 6 STD  WIEDERHERSTELLUNG FÜR","FÜR GRAFENTHAL R2208 S2 AB E5-2650",null,null,null,"X","X","X","X","X","X","X","X","X","X","X","X","X","X","X","X","X","X","X","X"]
[null,null,null,null,"740M6043",0,"GRAFENTHAL MPAC VOR ORT SERVICE UPGRADE","5JAHRE 13x5 24STD  WIEDERHERSTELLUNG FÜR","FÜR GRAFENTHAL R2208 S2 AB E5-2650",null,null,null,"X","X","X","X","X","X","X","X","X","X","X","X","X","X","X","X","X","X","X","X"]
[null,null,null,null,"740M6044",0,"GRAFENTHAL MPAC VOR ORT SERVICE UPGRADE","5JAHRE 13x5 12STD  WIEDERHERSTELLUNG FÜR","FÜR GRAFENTHAL R2208 S2 AB E5-2650",null,null,null,"X","X","X","X","X","X","X","X","X","X","X","X","X","X","X","X","X","X","X","X"]
[null,null,null,null,"740M6045",0,"GRAFENTHAL MPAC VOR ORT SERVICE UPGRADE","5JAHRE 24x7 6 STD  WIEDERHERSTELLUNG FÜR","FÜR GRAFENTHAL R2208 S2 AB E5-2650",null,null,null,"X","X","X","X","X","X","X","X","X","X","X","X","X","X","X","X","X","X","X","X"]
[null,null,null,null,"740M6088",0,"GRAFENTHAL MPAC VOR ORT SERVICE UPGRADE","3JAHRE 13x5 24STD  WIEDERHERSTELLUNG DMR","FÜR GRAFENTHAL R2208 S2 AB E5-2650",null,null,null,"X","X","X","X","X","X","X","X","X","X","X","X","X","X","X","X","X","X","X","X"]
[null,null,null,null,"740M6089",0,"GRAFENTHAL MPAC VOR ORT SERVICE UPGRADE","3JAHRE 13x5 12STD  WIEDERHERSTELLUNG DMR","FÜR GRAFENTHAL R2208 S2 AB E5-2650",null,null,null,"X","X","X","X","X","X","X","X","X","X","X","X","X","X","X","X","X","X","X","X"]
[null,null,null,null,"740M6090",0,"GRAFENTHAL MPAC VOR ORT SERVICE UPGRADE","3JAHRE 24x7 6 STD  WIEDERHERSTELLUNG DMR","FÜR GRAFENTHAL R2208 S2 AB E5-2650",null,null,null,"X","X","X","X","X","X","X","X","X","X","X","X","X","X","X","X","X","X","X","X"]
[null,null,null,null,"740M6091",0,"GRAFENTHAL MPAC VOR ORT SERVICE UPGRADE","4JAHRE 13x5 24STD  WIEDERHERSTELLUNG DMR","FÜR GRAFENTHAL R2208 S2 AB E5-2650",null,null,null,"X","X","X","X","X","X","X","X","X","X","X","X","X","X","X","X","X","X","X","X"]
[null,null,null,null,"740M6092",0,"GRAFENTHAL MPAC VOR ORT SERVICE UPGRADE","4JAHRE 13x5 12STD  WIEDERHERSTELLUNG DMR","FÜR GRAFENTHAL R2208 S2 AB E5-2650",null,null,null,"X","X","X","X","X","X","X","X","X","X","X","X","X","X","X","X","X","X","X","X"]
[null,null,null,null,"740M6093",0,"GRAFENTHAL MPAC VOR ORT SERVICE UPGRADE","4JAHRE 24x7 6 STD  WIEDERHERSTELLUNG DMR","FÜR GRAFENTHAL R2208 S2 AB E5-2650",null,null,null,"X","X","X","X","X","X","X","X","X","X","X","X","X","X","X","X","X","X","X","X"]
[null,null,null,null,"740M6094",0,"GRAFENTHAL MPAC VOR ORT SERVICE UPGRADE","5JAHRE 13x5 24STD  WIEDERHERSTELLUNG DMR","FÜR GRAFENTHAL R2208 S2 AB E5-2650",null,null,null,"X","X","X","X","X","X","X","X","X","X","X","X","X","X","X","X","X","X","X","X"]
[null,null,null,null,"740M6095",0,"GRAFENTHAL MPAC VOR ORT SERVICE UPGRADE","5JAHRE 13x5 12STD  WIEDERHERSTELLUNG DMR","FÜR GRAFENTHAL R2208 S2 AB E5-2650",null,null,null,"X","X","X","X","X","X","X","X","X","X","X","X","X","X","X","X","X","X","X","X"]
[null,null,null,null,"740M6096",0,"GRAFENTHAL MPAC VOR ORT SERVICE UPGRADE","5JAHRE 24x7 6 STD  WIEDERHERSTELLUNG DMR","FÜR GRAFENTHAL R2208 S2 AB E5-2650",null,null,null,"X","X","X","X","X","X","X","X","X","X","X","X","X","X","X","X","X","X","X","X"]
[null,null,null,null,"740M6028",0,"GRAFENTHAL MPAC VOR ORT SERVICE UPGRADE","3JAHRE 13x5 24STD  WIEDERHERSTELLUNG FÜR","FÜR GRAFENTHAL R2208 S2 BIS E5-264X",null,null,null,"X","X","X","X","X","X","X","X","X","X","X","X","X","X","X","X","X","X","X","X"]
[null,null,null,null,"740M6029",0,"GRAFENTHAL MPAC VOR ORT SERVICE UPGRADE","3JAHRE 13x5 12STD  WIEDERHERSTELLUNG FÜR","FÜR GRAFENTHAL R2208 S2 BIS E5-264X",null,null,null,"X","X","X","X","X","X","X","X","X","X","X","X","X","X","X","X","X","X","X","X"]
[null,null,null,null,"740M6030",0,"GRAFENTHAL MPAC VOR ORT SERVICE UPGRADE","3JAHRE 24x7 6 STD  WIEDERHERSTELLUNG FÜR","FÜR GRAFENTHAL R2208 S2 BIS E5-264X",null,null,null,"X","X","X","X","X","X","X","X","X","X","X","X","X","X","X","X","X","X","X","X"]
[null,null,null,null,"740M6031",0,"GRAFENTHAL MPAC VOR ORT SERVICE UPGRADE","4JAHRE 13x5 24STD  WIEDERHERSTELLUNG FÜR","FÜR GRAFENTHAL R2208 S2 BIS E5-264X",null,null,null,"X","X","X","X","X","X","X","X","X","X","X","X","X","X","X","X","X","X","X","X"]
[null,null,null,null,"740M6032",0,"GRAFENTHAL MPAC VOR ORT SERVICE UPGRADE","4JAHRE 13x5 12STD  WIEDERHERSTELLUNG FÜR","FÜR GRAFENTHAL R2208 S2 BIS E5-264X",null,null,null,"X","X","X","X","X","X","X","X","X","X","X","X","X","X","X","X","X","X","X","X"]
[null,null,null,null,"740M6033",0,"GRAFENTHAL MPAC VOR ORT SERVICE UPGRADE","4JAHRE 24x7 6 STD  WIEDERHERSTELLUNG FÜR","FÜR GRAFENTHAL R2208 S2 BIS E5-264X",null,null,null,"X","X","X","X","X","X","X","X","X","X","X","X","X","X","X","X","X","X","X","X"]
[null,null,null,null,"740M6034",0,"GRAFENTHAL MPAC VOR ORT SERVICE UPGRADE","5JAHRE 13x5 24STD  WIEDERHERSTELLUNG FÜR","FÜR GRAFENTHAL R2208 S2 BIS E5-264X",null,null,null,"X","X","X","X","X","X","X","X","X","X","X","X","X","X","X","X","X","X","X","X"]
[null,null,null,null,"740M6035",0,"GRAFENTHAL MPAC VOR ORT SERVICE UPGRADE","5JAHRE 13x5 12STD  WIEDERHERSTELLUNG FÜR","FÜR GRAFENTHAL R2208 S2 BIS E5-264X",null,null,null,"X","X","X","X","X","X","X","X","X","X","X","X","X","X","X","X","X","X","X","X"]
[null,null,null,null,"740M6036",0,"GRAFENTHAL MPAC VOR ORT SERVICE UPGRADE","5JAHRE 24x7 6 STD  WIEDERHERSTELLUNG FÜR","FÜR GRAFENTHAL R2208 S2 BIS E5-264X",null,null,null,"X","X","X","X","X","X","X","X","X","X","X","X","X","X","X","X","X","X","X","X"]
[null,null,null,null,"740M6079",0,"GRAFENTHAL MPAC VOR ORT SERVICE UPGRADE","3JAHRE 13x5 24STD  WIEDERHERSTELLUNG DMR","FÜR GRAFENTHAL R2208 S2 BIS E5-264X",null,null,null,"X","X","X","X","X","X","X","X","X","X","X","X","X","X","X","X","X","X","X","X"]
[null,null,null,null,"740M6080",0,"GRAFENTHAL MPAC VOR ORT SERVICE UPGRADE","3JAHRE 13x5 12STD  WIEDERHERSTELLUNG DMR","FÜR GRAFENTHAL R2208 S2 BIS E5-264X",null,null,null,"X","X","X","X","X","X","X","X","X","X","X","X","X","X","X","X","X","X","X","X"]
[null,null,null,null,"740M6081",0,"GRAFENTHAL MPAC VOR ORT SERVICE UPGRADE","3JAHRE 24x7 6 STD  WIEDERHERSTELLUNG DMR","FÜR GRAFENTHAL R2208 S2 BIS E5-264X",null,null,null,"X","X","X","X","X","X","X","X","X","X","X","X","X","X","X","X","X","X","X","X"]
[null,null,null,null,"740M6082",0,"GRAFENTHAL MPAC VOR ORT SERVICE UPGRADE","4JAHRE 13x5 24STD  WIEDERHERSTELLUNG DMR","FÜR GRAFENTHAL R2208 S2 BIS E5-264X",null,null,null,"X","X","X","X","X","X","X","X","X","X","X","X","X","X","X","X","X","X","X","X"]
[null,null,null,null,"740M6083",0,"GRAFENTHAL MPAC VOR ORT SERVICE UPGRADE","4JAHRE 13x5 12STD  WIEDERHERSTELLUNG DMR","FÜR GRAFENTHAL R2208 S2 BIS E5-264X",null,null,null,"X","X","X","X","X","X","X","X","X","X","X","X","X","X","X","X","X","X","X","X"]
[null,null,null,null,"740M6084",0,"GRAFENTHAL MPAC VOR ORT SERVICE UPGRADE","4JAHRE 24x7 6 STD  WIEDERHERSTELLUNG DMR","FÜR GRAFENTHAL R2208 S2 BIS E5-264X",null,null,null,"X","X","X","X","X","X","X","X","X","X","X","X","X","X","X","X","X","X","X","X"]
[null,null,null,null,"740M6085",0,"GRAFENTHAL MPAC VOR ORT SERVICE UPGRADE","5JAHRE 13x5 24STD  WIEDERHERSTELLUNG DMR","FÜR GRAFENTHAL R2208 S2 BIS E5-264X",null,null,null,"X","X","X","X","X","X","X","X","X","X","X","X","X","X","X","X","X","X","X","X"]
[null,null,null,null,"740M6086",0,"GRAFENTHAL MPAC VOR ORT SERVICE UPGRADE","5JAHRE 13x5 12STD  WIEDERHERSTELLUNG DMR","FÜR GRAFENTHAL R2208 S2 BIS E5-264X",null,null,null,"X","X","X","X","X","X","X","X","X","X","X","X","X","X","X","X","X","X","X","X"]
[null,null,null,null,"740M6087",0,"GRAFENTHAL MPAC VOR ORT SERVICE UPGRADE","5JAHRE 24x7 6 STD  WIEDERHERSTELLUNG DMR","FÜR GRAFENTHAL R2208 S2 BIS E5-264X",null,null,null,"X","X","X","X","X","X","X","X","X","X","X","X","X","X","X","X","X","X","X","X"]
[null,null,null,null,"CONFIG-TO-ORDER",{"$f":"SUM(F160:F163)","v":0}]
[null,null,null,null,"CTO",0,"HARDWARE ASSEMBLIERUNG",null,null,null,null,null,"X","X","X","X","X","X","X","X","X","X","X","X","X","X","X","X","X","X","X","X"]
[null,null,null,null,"CTO1",0,"HARDWARE ASSEMBLIERUNG & FIRMWARE UPDATE",null,null,null,null,null,"X","X","X","X","X","X","X","X","X","X","X","X","X","X","X","X","X","X","X","X"]
[null,null,null,null,"CTO2",0,"HARDWARE ASSEMBLIERUNG, FIRMWARE UPDATE & RAID EINRICHTUNG",null,null,null,null,null,"X","X","X","X","X","X","X","X","X","X","X","X","X","X","X","X","X","X","X","X"]
[null,null,null,null,"CTO3",0,"HARDWARE ASSEMBLIERUNG, FIRMWARE UPDATE, RAID EINRICHTUNG & OS INSTALLATION",null,null,null,null,null,"X","X","X","X","X","X","X","X","X","X","X","X","X","X","X","X","X","X","X","X"]
[null,null,null,null,"USB Drive",{"$f":"SUM(F165:F166)","v":0}]
[null,null,null,null,"652G6004",0,"GRAFENTHAL USB 3.0 FLASH DRIVE","ULTRA FIT 64GB UP TO 150MB/S"," ",null,null,null,"X","X","X","X","X","X","X","X","X","X","X","X","X","X","X","X","X","X","X","X"]
[null,null,null,null,"652G6005",0,"GRAFENTHAL USB 3.0 FLASH DRIVE","ULTRA FIT 128GB UP TO 150MB/S"," ",null,null,null,"X","X","X","X","X","X","X","X","X","X","X","X","X","X","X","X","X","X","X","X"]
[null,null,null,null,"USV- Systeme",{"$f":"SUM(F168:F171)","v":0}]
[null,null,null,null,"132G0150",0,"GRAFENTHAL USV ETR-1500 TOWER RACK LINE","INTERACTIVE 1500VA 1200W PURE SINEWAVE","ECO MODE 23KG CE ROHS GERMAN",null,null,null,"X","X","X","X","X","X","X","X","X","X","X","X","X","X","X","X","X","X","X","X"]
[null,null,null,null,"132G0300",0,"GRAFENTHAL USV ETR-3000 TOWER RACK LINE","INTERACTIVE 3000VA 2400W PURE SINEWAVE","ECO MODE 35KG CE ROHS GERMAN",null,null,null,"X","X","X","X","X","X","X","X","X","X","X","X","X","X","X","X","X","X","X","X"]
[null,null,null,null,"113G1150",0,"GRAFENTHAL USV PR-1500-HS PROGRAMMABLE","ECO MODE RACK MOUNT 2U USB RS232 LCD"," ",null,null,null,"X","X","X","X","X","X","X","X","X","X","X","X","X","X","X","X","X","X","X","X"]
[null,null,null,null,"113G1300",0,"GRAFENTHAL USV PR-3000-HS ONLINE","ECO MODE RACK MOUNT 2U USB RS232 LCD"," ",null,null,null,"X","X","X","X","X","X","X","X","X","X","X","X","X","X","X","X","X","X","X","X"]
[null,null,null,null,"USV- Zubehör",{"$f":"SUM(F173:F174)","v":0}]
[null,null,null,null,"149G6005",0,"GRAFENTHAL USV SNMP CARD PRO S2","FOR ETR AND PR AND PTR SERIES","MULTI SERVER SHUTDOWN",null,null,null,"X","X","X","X","X","X","X","X","X","X","X","X","X","X","X","X","X","X","X","X"]
[null,null,null,null,"149G5003",0,"GRAFENTHAL USV ACCESSORY LICENSE FOR","SNMP PRO CARD FOR ETR AND PR SERIES","MULTI SERVER SHUTDOWN",null,null,null,"X","X","X","X","X","X","X","X","X","X","X","X","X","X","X","X","X","X","X","X"]
[null,null,null,null,"SUMME",1,null,null,null,{"$f":"COUNTIF($J$176:$AG$176,\"<0\")","v":0}]
[null,null,null,null,null,null,null,null,null,{"$f":"SUM(J14:J174)","v":0},{"$f":"SUM(K14:K174)","v":0},{"$f":"SUM(L14:L174)","v":0},{"$f":"SUM(M14:M174)","v":0},0,0,0,0,0,0,0,0,0,0,0,0,0,0,0,0,{"$f":"SUM(AD14:AD174)","v":0},0,0,0]

{"sheet":"R2208 S3","index":9,"n_rows":202,"n_cols":35,"rows_kept":202,"cut":false,"hidden":false,"merged":[[0,4,0,8]]}
[null,null,null,null,"2U Rackserver R2208 S3",null,null,null,null,null,null,"Konfigurator-Notizen R2208 S3",null,null,null,"obsolet",null,null,null,null,null,null,"obsolet"]
[null,null,null,null,null,null,null,null,null,null,null,"board 2 CPU slots","CPU-abhängig",null,null,"CPU 0","CPU 0/1","CPU 1",null,"CPU0",null,null,"backplane HotSwap","backplane HotSwap","backplane HotSwap","CPU 1","CPU0/CPU1"]
[null,null,null,null,null,null,null,"• Zwei CPU Sockets der Intel® Xeon® Scalable Prozessoren Produktfamilie","more Info",null,null,"minimal (base)  1","base 12","base 32",null,"base","base","base","base",null,null,null,"base 1",null,null,"NVME ports","SAS /NVME ports"]
[null,null,null,null,null,null,null,"• bis 1,5TB Arbeitsspeicher ",null,null,null,"CPU 0","Mem Slots","PCIe lanes","PCIe lanes Risercards","risercard 0","risercard 1","risercard 2","extens. card (max 8 )","intern nonHS","backplane 'slots'","backplane 'slots'","bp 0","bp 1","bp 2","ocu-links *4","raidctrl.","SATA auf raid ctrl","Cache","HotSwap slots 3,5\"","HotSwap slots 2,5\"","HotSwap slots 2,5\""]
[null,null,null,null,null,null,null,"• auf bis zu 24 x Hot-Swap HDD oder SSD erweiterbar ",null,null,null,null,"(Menge x 12)","(Menge CPUs x 32 lanes)",null,"(+24 lanes)","(+8 / +16 lanes)","(+16 lanes)","(*-8 lanes)","M.2 (max 2 )","front","rear","cable pwr  bp0","cable pwr  bp1","cable pwr  bp2","( separate lanes)","(* -8 lanes)","mischbar","battery","physical","physical","physical"]
[null,null,null,null,null,null,null,"• Quadro Gigabit Ethernet ",null,null,null,null,null,"\"on board\"",null,"3 extens. slots","3 extens. slots","2 extens. Slots","(*-1 extens. Slot)","M.2.riser card (auto )","HS","HS","cable BMC bp0","cable BMC bp1","cable BMC bp2","dirves:","(* -1 exts. slot)","SAS ports abhängig von ",null,null,"NVME","SAS"]
[null,null,null,null,null,null,null,"• Fernwartung per Remote ","*) \"Menge\" filtern um Konfiguration anzuzeigen",null,null,null,null,null,null,null,null,null,"slots on risercard:","(separate lanes konkurrent: Ssata))",null,null,"SAS ports *8","SAS ports *8","SAS ports *8","(* -4 SAS ports","(* + $i SAS ports) ","tatsächlich verbauten "]
[null,null,null,null,null,null,null,null,"* Felder werden automatisch ausgefüllt",null,null,null,null,null,null,null,null,null,"0,0,1,0,1,1,2,2","drives","1 base",null,"cable SAS (2 x intern miniSAS -> OCU link)","cable SAS (2 x intern miniSAS -> OCU link)","cable SAS (2 x intern miniSAS -> OCU link)","(auto + cable)","(auto + cable)","SATA Platten"]
[null,null,null,null,null,null,null,null,null,"Fehlerzähler",null,null,null,null,null,null,null,null,null,"(*- 1 M.2 slot)",null,null,"SAS * 4 & NVME *2","SAS * 4 & NVME *2","(SAS * 4 & NVME *2)","(* +1 NVME port)"]
[null,null,null,null,null,"Die aktuelle Konfiguration ist fehlerhaft !",null,null,null,{"$f":"J201","v":0},null,null,null,null,null,null,null,null,null,null,null,null,"cable NVME (2 x OCUlink->OCUlink)","cable NVME (2 x OCUlink->OCUlink)","cable NVME (2 x OCUlink->OCUlink)"]
[null,null,null,null,"Konfigurator",null,{"$f":"'Revision Info'!B10","v":"Revision 15"},null,null,{"$f":"J202","v":0},{"$f":"K202","v":0},0,0,0,0,0,0,0,0,0,0,0,0,0,0,0,0,0,0,0,0,0,0,0,0]
[null,null,null,null,"ART. NR.","Menge\n     *)","Bezeichnung","Bezeichnung II","Bezeichnung III","nicht kombinierbar","nicht konfigurierbar","CPU slots","MEM Slots","PCIe lanes for\nextension cards","PCIe lanes via RiserCards","RiserCard 0","RiserCard 1","RiserCard 2","extension slots","M.2slots via M.2-riser\nnon HS","Bckpl Slots Front","Bckpl Slots Rear","Spalte3","Spalte4","Spalte5","NVME-ports","SAS ports","SATA ports","Raid Cotroller Cache battery","HDD slots 3,5\"\nHS","HDD slots 2,5\"\nHS NVME","HDD slots 2,5\" \nHS SAS","DVD Slot","PSU Slot","OCP Conn C\nPHY-Card"]
[null,null,null,null,"Maschinentyp",{"$f":"SUM(F14:F14)","v":0},"*mindestens eine Grundmaschine auswählen*",null,null,"if (Kombi);-1;0","if Menge;-1;0","(Menge x Eigenschaft)","(Menge x Eigenschaft)","(Menge x Eigenschaft)","(Menge x Eigenschaft)","(Menge x Eigenschaft)","(Menge x Eigenschaft)","(Menge x Eigenschaft)","(Menge x Eigenschaft)","(Menge x Eigenschaft)","(Menge x Eigenschaft)","(Menge x Eigenschaft)","(Menge x Eigenschaft)","(Menge x Eigenschaft)","(Menge x Eigenschaft)","(Menge x Eigenschaft)","(Menge x Eigenschaft)",null,"(MengexEigenschaft)","(Menge x Eigenschaft)","(Menge x Eigenschaft)","(Menge x Eigenschaft)","(Menge x Eigenschaft)","(Menge x Eigenschaft)","(Menge x Eigenschaft)"]
[null,null,null,null,"612G8201",0,"GRAFENTHAL CTO RACK SERVER 2U R2208 S3","2X SCALABLE XEON CPU 8x2,5'' BAYS","MAX 24xDIMMS 1/2 RED PSU 800W",null,{"$f":"IF(Tabelle43[[#This Row],[Menge\n     *)]]>1,-1,0)","v":0},{"$f":"Tabelle43[[#This Row],[Menge\n     *)]]*2","v":0},null,{"$f":"Tabelle43[[#This Row],[Menge\n     *)]]*0","v":0},{"$f":"Tabelle43[[#This Row],[Menge\n     *)]]*0","v":0},{"$f":"Tabelle43[[#This Row],[Menge\n     *)]]*0","v":0},{"$f":"Tabelle43[[#This Row],[Menge\n     *)]]*0","v":0},{"$f":"Tabelle43[[#This Row],[Menge\n     *)]]*0","v":0},{"$f":"Tabelle43[[#This Row],[Menge\n     *)]]*0","v":0},{"$f":"Tabelle43[[#This Row],[Menge\n     *)]]*2","v":0},{"$f":"Tabelle43[[#This Row],[Menge\n     *)]]*3","v":0},{"$f":"Tabelle43[[#This Row],[Menge\n     *)]]*0","v":0},{"$f":"Tabelle43[[#This Row],[Menge\n     *)]]*0","v":0},{"$f":"Tabelle43[[#This Row],[Menge\n     *)]]*0","v":0},{"$f":"Tabelle43[[#This Row],[Menge\n     *)]]*0","v":0},{"$f":"Tabelle43[[#This Row],[Menge\n     *)]]*0","v":0},{"$f":"Tabelle43[[#This Row],[Menge\n     *)]]*0","v":0},{"$f":"Tabelle43[[#This Row],[Menge\n     *)]]*0","v":0},{"$f":"Tabelle43[[#This Row],[Menge\n     *)]]*0","v":0},{"$f":"Tabelle43[[#This Row],[Menge\n     *)]]*0","v":0},{"$f":"Tabelle43[[#This Row],[Menge\n     *)]]*0","v":0},{"$f":"Tabelle43[[#This Row],[Menge\n     *)]]*0","v":0},{"$f":"Tabelle43[[#This Row],[Menge\n     *)]]*0","v":0},{"$f":"Tabelle43[[#This Row],[Menge\n     *)]]*2","v":0},{"$f":"Tabelle43[[#This Row],[Menge\n     *)]]*1","v":0}]
[null,null,null,null,"Prozessor",{"$f":"SUM(F16:F39)","v":0}," mindestens 1 CPU benötigt"]
[null,null,null,null,"656G8022",0,"GRAFENTHAL CPU XEON BRONZE 3104 1.70GHz","6C 8.25MB 85W"," ",{"$f":"IF(COUNTIF(F16:F39,\"<>0\")>1,-1,0)","v":0},null,{"$f":"Tabelle43[[#This Row],[Menge\n     *)]]*-1","v":0},{"$f":"Tabelle43[[#This Row],[Menge\n     *)]]*12","v":0},{"$f":"Tabelle43[[#This Row],[Menge\n     *)]]*32","v":0},null,null,null,null,null,null,null,null,null,null,null,{"$f":"IF(Tabelle43[[#This Row],[Menge\n     *)]]=2,4,0)","v":0}]
[null,null,null,null,"656G8024",0,"GRAFENTHAL CPU XEON SILVER 4108 1.80GHz","8C 11MB 85W"," ",null,null,{"$f":"Tabelle43[[#This Row],[Menge\n     *)]]*-1","v":0},{"$f":"Tabelle43[[#This Row],[Menge\n     *)]]*12","v":0},{"$f":"Tabelle43[[#This Row],[Menge\n     *)]]*32","v":0},null,null,null,null,null,null,null,null,null,null,null,{"$f":"IF(Tabelle43[[#This Row],[Menge\n     *)]]=2,4,0)","v":0}]
[null,null,null,null,"656G8026",0,"GRAFENTHAL CPU XEON SILVER 4110 2.10GHz","8C 11MB 85W"," ",null,null,{"$f":"Tabelle43[[#This Row],[Menge\n     *)]]*-1","v":0},{"$f":"Tabelle43[[#This Row],[Menge\n     *)]]*12","v":0},{"$f":"Tabelle43[[#This Row],[Menge\n     *)]]*32","v":0},null,null,null,null,null,null,null,null,null,null,null,{"$f":"IF(Tabelle43[[#This Row],[Menge\n     *)]]=2,4,0)","v":0}]
[null,null,null,null,"656G8025",0,"GRAFENTHAL CPU XEON SILVER 4114 3.00GHz","10C 13.75MB 85W"," ",null,null,{"$f":"Tabelle43[[#This Row],[Menge\n     *)]]*-1","v":0},{"$f":"Tabelle43[[#This Row],[Menge\n     *)]]*12","v":0},{"$f":"Tabelle43[[#This Row],[Menge\n     *)]]*32","v":0},null,null,null,null,null,null,null,null,null,null,null,{"$f":"IF(Tabelle43[[#This Row],[Menge\n     *)]]=2,4,0)","v":0}]
[null,null,null,null,"656G8028",0,"GRAFENTHAL CPU XEON SILVER 4116 2.10GHz","12C 16.5MB 85W"," ",null,null,{"$f":"Tabelle43[[#This Row],[Menge\n     *)]]*-1","v":0},{"$f":"Tabelle43[[#This Row],[Menge\n     *)]]*12","v":0},{"$f":"Tabelle43[[#This Row],[Menge\n     *)]]*32","v":0},null,null,null,null,null,null,null,null,null,null,null,{"$f":"IF(Tabelle43[[#This Row],[Menge\n     *)]]=2,4,0)","v":0}]
[null,null,null,null,"656G8030",0,"GRAFENTHAL CPU XEON GOLD 5118 2.30GHz","12C 16.5MB 105W"," ",null,null,{"$f":"Tabelle43[[#This Row],[Menge\n     *)]]*-1","v":0},{"$f":"Tabelle43[[#This Row],[Menge\n     *)]]*12","v":0},{"$f":"Tabelle43[[#This Row],[Menge\n     *)]]*32","v":0},null,null,null,null,null,null,null,null,null,null,null,{"$f":"IF(Tabelle43[[#This Row],[Menge\n     *)]]=2,4,0)","v":0}]
[null,null,null,null,"656G8031",0,"GRAFENTHAL CPU XEON GOLD 5120 2.20GHz","14C 19.25MB 105W"," ",null,null,{"$f":"Tabelle43[[#This Row],[Menge\n     *)]]*-1","v":0},{"$f":"Tabelle43[[#This Row],[Menge\n     *)]]*12","v":0},{"$f":"Tabelle43[[#This Row],[Menge\n     *)]]*32","v":0},null,null,null,null,null,null,null,null,null,null,null,{"$f":"IF(Tabelle43[[#This Row],[Menge\n     *)]]=2,4,0)","v":0}]
[null,null,null,null,"656G8033",0,"GRAFENTHAL CPU XEON GOLD 6126 2.60GHz","12C 19.20MB 125W"," ",null,null,{"$f":"Tabelle43[[#This Row],[Menge\n     *)]]*-1","v":0},{"$f":"Tabelle43[[#This Row],[Menge\n     *)]]*12","v":0},{"$f":"Tabelle43[[#This Row],[Menge\n     *)]]*32","v":0},null,null,null,null,null,null,null,null,null,null,null,{"$f":"IF(Tabelle43[[#This Row],[Menge\n     *)]]=2,4,0)","v":0}]
[null,null,null,null,"656G8034",0,"GRAFENTHAL CPU XEON GOLD 6128 3.40GHz","6C 19.25MB 115W"," ",null,null,{"$f":"Tabelle43[[#This Row],[Menge\n     *)]]*-1","v":0},{"$f":"Tabelle43[[#This Row],[Menge\n     *)]]*12","v":0},{"$f":"Tabelle43[[#This Row],[Menge\n     *)]]*32","v":0},null,null,null,null,null,null,null,null,null,null,null,{"$f":"IF(Tabelle43[[#This Row],[Menge\n     *)]]=2,4,0)","v":0}]
[null,null,null,null,"656G8035",0,"GRAFENTHAL CPU XEON GOLD 6130 2.10GHz","16C 22MB 125W"," ",null,null,{"$f":"Tabelle43[[#This Row],[Menge\n     *)]]*-1","v":0},{"$f":"Tabelle43[[#This Row],[Menge\n     *)]]*12","v":0},{"$f":"Tabelle43[[#This Row],[Menge\n     *)]]*32","v":0},null,null,null,null,null,null,null,null,null,null,null,{"$f":"IF(Tabelle43[[#This Row],[Menge\n     *)]]=2,4,0)","v":0}]
[null,null,null,null,"656G8036",0,"GRAFENTHAL CPU XEON GOLD 6132 2.60GHz","14C 19.25MB 140W"," ",null,null,{"$f":"Tabelle43[[#This Row],[Menge\n     *)]]*-1","v":0},{"$f":"Tabelle43[[#This Row],[Menge\n     *)]]*12","v":0},{"$f":"Tabelle43[[#This Row],[Menge\n     *)]]*32","v":0},null,null,null,null,null,null,null,null,null,null,null,{"$f":"IF(Tabelle43[[#This Row],[Menge\n     *)]]=2,4,0)","v":0}]
[null,null,null,null,"656G8037",0,"GRAFENTHAL CPU XEON GOLD 6134 3.20GHz","8C 24.75MB 130W"," ",null,null,{"$f":"Tabelle43[[#This Row],[Menge\n     *)]]*-1","v":0},{"$f":"Tabelle43[[#This Row],[Menge\n     *)]]*12","v":0},{"$f":"Tabelle43[[#This Row],[Menge\n     *)]]*32","v":0},null,null,null,null,null,null,null,null,null,null,null,{"$f":"IF(Tabelle43[[#This Row],[Menge\n     *)]]=2,4,0)","v":0}]
[null,null,null,null,"656G8040",0,"GRAFENTHAL CPU XEON GOLD 6140 2.30GHz","18C 24.70MB 140W"," ",null,null,{"$f":"Tabelle43[[#This Row],[Menge\n     *)]]*-1","v":0},{"$f":"Tabelle43[[#This Row],[Menge\n     *)]]*12","v":0},{"$f":"Tabelle43[[#This Row],[Menge\n     *)]]*32","v":0},null,null,null,null,null,null,null,null,null,null,null,{"$f":"IF(Tabelle43[[#This Row],[Menge\n     *)]]=2,4,0)","v":0}]
[null,null,null,null,"656G8041",0,"GRAFENTHAL CPU XEON GOLD 6142 2.60GHz","16C 22MB 150W"," ",null,null,{"$f":"Tabelle43[[#This Row],[Menge\n     *)]]*-1","v":0},{"$f":"Tabelle43[[#This Row],[Menge\n     *)]]*12","v":0},{"$f":"Tabelle43[[#This Row],[Menge\n     *)]]*32","v":0},null,null,null,null,null,null,null,null,null,null,null,{"$f":"IF(Tabelle43[[#This Row],[Menge\n     *)]]=2,4,0)","v":0}]
[null,null,null,null,"656G8042",0,"GRAFENTHAL CPU XEON GOLD 6144 3.50GHz","8C 24.75MB 150W"," ",null,null,{"$f":"Tabelle43[[#This Row],[Menge\n     *)]]*-1","v":0},{"$f":"Tabelle43[[#This Row],[Menge\n     *)]]*12","v":0},{"$f":"Tabelle43[[#This Row],[Menge\n     *)]]*32","v":0},null,null,null,null,null,null,null,null,null,null,null,{"$f":"IF(Tabelle43[[#This Row],[Menge\n     *)]]=2,4,0)","v":0}]
[null,null,null,null,"656G8043",0,"GRAFENTHAL CPU XEON GOLD 6146 3.20GHz","12C 24.75MB 165W"," ",null,null,{"$f":"Tabelle43[[#This Row],[Menge\n     *)]]*-1","v":0},{"$f":"Tabelle43[[#This Row],[Menge\n     *)]]*12","v":0},{"$f":"Tabelle43[[#This Row],[Menge\n     *)]]*32","v":0},null,null,null,null,null,null,null,null,null,null,null,{"$f":"IF(Tabelle43[[#This Row],[Menge\n     *)]]=2,4,0)","v":0}]
[null,null,null,null,"656G8044",0,"GRAFENTHAL CPU XEON GOLD 6148 2.40GHz","20C 27.5MB 150W"," ",null,null,{"$f":"Tabelle43[[#This Row],[Menge\n     *)]]*-1","v":0},{"$f":"Tabelle43[[#This Row],[Menge\n     *)]]*12","v":0},{"$f":"Tabelle43[[#This Row],[Menge\n     *)]]*32","v":0},null,null,null,null,null,null,null,null,null,null,null,{"$f":"IF(Tabelle43[[#This Row],[Menge\n     *)]]=2,4,0)","v":0}]
[null,null,null,null,"656G8046",0,"GRAFENTHAL CPU XEON GOLD 6152 2.10GHz","22C 30.25MB 140W"," ",null,null,{"$f":"Tabelle43[[#This Row],[Menge\n     *)]]*-1","v":0},{"$f":"Tabelle43[[#This Row],[Menge\n     *)]]*12","v":0},{"$f":"Tabelle43[[#This Row],[Menge\n     *)]]*32","v":0},null,null,null,null,null,null,null,null,null,null,null,{"$f":"IF(Tabelle43[[#This Row],[Menge\n     *)]]=2,4,0)","v":0}]
[null,null,null,null,"656G8048",0,"GRAFENTHAL CPU XEON PLATINUM 8153","2.00GHz 16C 22MB 125W"," ",null,null,{"$f":"Tabelle43[[#This Row],[Menge\n     *)]]*-1","v":0},{"$f":"Tabelle43[[#This Row],[Menge\n     *)]]*12","v":0},{"$f":"Tabelle43[[#This Row],[Menge\n     *)]]*32","v":0},null,null,null,null,null,null,null,null,null,null,null,{"$f":"IF(Tabelle43[[#This Row],[Menge\n     *)]]=2,4,0)","v":0}]
[null,null,null,null,"656G8049",0,"GRAFENTHAL CPU XEON PLATINUM 8156","3.60GHz 4C 16.5MB 105W"," ",null,null,{"$f":"Tabelle43[[#This Row],[Menge\n     *)]]*-1","v":0},{"$f":"Tabelle43[[#This Row],[Menge\n     *)]]*12","v":0},{"$f":"Tabelle43[[#This Row],[Menge\n     *)]]*32","v":0},null,null,null,null,null,null,null,null,null,null,null,{"$f":"IF(Tabelle43[[#This Row],[Menge\n     *)]]=2,4,0)","v":0}]
[null,null,null,null,"656G8051",0,"GRAFENTHAL CPU XEON PLATINUM 8160","2.10GHz 24C 33MB 150W"," ",null,null,{"$f":"Tabelle43[[#This Row],[Menge\n     *)]]*-1","v":0},{"$f":"Tabelle43[[#This Row],[Menge\n     *)]]*12","v":0},{"$f":"Tabelle43[[#This Row],[Menge\n     *)]]*32","v":0},null,null,null,null,null,null,null,null,null,null,null,{"$f":"IF(Tabelle43[[#This Row],[Menge\n     *)]]=2,4,0)","v":0}]
[null,null,null,null,"656G8053",0,"GRAFENTHAL CPU XEON PLATINUM 8164","2.00GHz 26C 35.75MB 150W"," ",null,null,{"$f":"Tabelle43[[#This Row],[Menge\n     *)]]*-1","v":0},{"$f":"Tabelle43[[#This Row],[Menge\n     *)]]*12","v":0},{"$f":"Tabelle43[[#This Row],[Menge\n     *)]]*32","v":0},null,null,null,null,null,null,null,null,null,null,null,{"$f":"IF(Tabelle43[[#This Row],[Menge\n     *)]]=2,4,0)","v":0}]
[null,null,null,null,"656G8055",0,"GRAFENTHAL CPU XEON PLATINUM 8176","2.10GHz 28C 38.5MB 165W"," ",null,null,{"$f":"Tabelle43[[#This Row],[Menge\n     *)]]*-1","v":0},{"$f":"Tabelle43[[#This Row],[Menge\n     *)]]*12","v":0},{"$f":"Tabelle43[[#This Row],[Menge\n     *)]]*32","v":0},null,null,null,null,null,null,null,null,null,null,null,{"$f":"IF(Tabelle43[[#This Row],[Menge\n     *)]]=2,4,0)","v":0}]
[null,null,null,null,"656G8056",0,"GRAFENTHAL CPU XEON PLATINUM 8180","2.50GHz 28C 38.5MB 205W"," ",null,null,{"$f":"Tabelle43[[#This Row],[Menge\n     *)]]*-1","v":0},{"$f":"Tabelle43[[#This Row],[Menge\n     *)]]*12","v":0},{"$f":"Tabelle43[[#This Row],[Menge\n     *)]]*32","v":0},null,null,null,null,null,null,null,null,null,null,null,{"$f":"IF(Tabelle43[[#This Row],[Menge\n     *)]]=2,4,0)","v":0}]
[null,null,null,null,"CPU-Zubehör",{"$f":"SUM(F41:F42)","v":0},""]
[null,null,null,null,"659G8001",{"$f":"IF(SUM($F$16:$F$39)>0,SUM($F$16:$F$39),0)","v":0},"GRAFENTHAL CPU COOLER FOR R2208 S3 /","R2216 S3"," "]
[null,null,null,null,"659G8014",{"$f":"F41","v":0},"GRAFENTHAL XEON SCALABLE CPU HOLDER TRAY"," "," "]
[null,null,null,null,"Arbeitsspeicher",{"$f":"SUM(F44:F46)","v":0},""]
[null,null,null,null,"652G8000",0,"GRAFENTHAL MEM 16GB DDR4-2666MHz RDIMM","PC4-21300 CL 19 DUAL RANKED ECC"," ",null,null,null,{"$f":"Tabelle43[[#This Row],[Menge\n     *)]]*-1","v":0}]
[null,null,null,null,"652G8001",0,"GRAFENTHAL MEM 32GB DDR4-2666MHz RDIMM","PC4-21300 CL19 DUAL RANKED ECC"," ",null,null,null,{"$f":"Tabelle43[[#This Row],[Menge\n     *)]]*-1","v":0}]
[null,null,null,null,"652G8002",0,"GRAFENTHAL MEM 64GB DDR4-2666MHz RDIMM","PC4-21300 CL19 DUAL RANKED ECC"," ",null,null,null,{"$f":"Tabelle43[[#This Row],[Menge\n     *)]]*-1","v":0}]
[null,null,null,null,"HDD Expansion (front)",{"$f":"SUM(F48:F48)","v":0},""]
[null,null,null,null,"657G8001",0,"GRAFENTHAL HDD EXPANSION KIT 8x2,5\\ SAS\"","2xNVMe BACKPLANE FOR R2208 S3"," ",null,null,null,null,null,null,null,null,null,null,null,{"$f":"IF(U14>0,SUM(Tabelle43[[#This Row],[Menge\n     *)]]*-1,-1),0)","v":0},null,null,null,null,null,null,null,null,null,{"$f":"Tabelle43[[#This Row],[Menge\n     *)]]*2","v":0},{"$f":"Tabelle43[[#This Row],[Menge\n     *)]]*8","v":0}]
[null,null,null,null,"HDD Expansion (rear)",{"$f":"SUM(F50:F50)","v":0},""]
[null,null,null,null,null,0,{"$error":"#N/A"},{"$error":"#N/A"},{"$error":"#N/A"},null,null,null,null,null,null,null,null,null,null,null,null,{"$f":"IF(V14>0,SUM(Tabelle43[[#This Row],[Menge\n     *)]]*-1,-1),0)","v":0},null,null,null,null,null,null,null,null,{"$f":"Tabelle43[[#This Row],[Menge\n     *)]]*2","v":0},{"$f":"Tabelle43[[#This Row],[Menge\n     *)]]*8","v":0}]
[null,null,null,null,"Festplatten",{"$f":"SUM(F64:F69)","v":0}]
[null,null,null,null,"SATA",{"$f":"SUM(F53,F56)","v":0}]
[null,null,null,null,"SATA 2,5\" SSD 6GB/s *MIDRANGE*",{"$f":"SUM(F54:F55)","v":0}]
[null,null,null,null,"651G7011",0,"GRAFENTHAL SSD 240GB 2.5'' SATA 6GB/S","MIDRANGE 599 TBW"," ",null,null,null,null,null,null,null,null,null,null,null,null,null,null,null,null,null,null,{"$f":"Tabelle43[[#This Row],[Menge\n     *)]]*-1","v":0},null,null,null,{"$f":"Tabelle43[[#This Row],[Menge\n     *)]]*-1","v":0}]
[null,null,null,null,"651G7012",0,"GRAFENTHAL SSD 480GB 2.5'' SATA 6GB/S","MIDRANGE 945 TBW"," ",null,null,null,null,null,null,null,null,null,null,null,null,null,null,null,null,null,null,{"$f":"Tabelle43[[#This Row],[Menge\n     *)]]*-1","v":0},null,null,null,{"$f":"Tabelle43[[#This Row],[Menge\n     *)]]*-1","v":0}]
[null,null,null,null,"SATA 2,5\" SSD 6GB/s *ENTRY*",{"$f":"SUM(F57:F61)","v":0}]
[null,null,null,null,"651G8024",0,"GRAFENTHAL SSD 256GB SATA3 6GB/S 2.5''","MTBF 1.5M HOURS TBW 300TB"," ",null,null,null,null,null,null,null,null,null,null,null,null,null,null,null,null,null,null,{"$f":"Tabelle43[[#This Row],[Menge\n     *)]]*-1","v":0},null,null,null,{"$f":"Tabelle43[[#This Row],[Menge\n     *)]]*-1","v":0}]
[null,null,null,null,"651G8025",0,"GRAFENTHAL SSD 512GB SATA3 6GB/S 2.5''","MTBF 1.5M HOURS TBW 300TB"," ",null,null,null,null,null,null,null,null,null,null,null,null,null,null,null,null,null,null,{"$f":"Tabelle43[[#This Row],[Menge\n     *)]]*-1","v":0},null,null,null,{"$f":"Tabelle43[[#This Row],[Menge\n     *)]]*-1","v":0}]
[null,null,null,null,"651G8026",0,"GRAFENTHAL SSD 1TB SATA3 6GB/S 2.5''","MTBF 1.5M HOURS TBW 300TB"," ",null,null,null,null,null,null,null,null,null,null,null,null,null,null,null,null,null,null,{"$f":"Tabelle43[[#This Row],[Menge\n     *)]]*-1","v":0},null,null,null,{"$f":"Tabelle43[[#This Row],[Menge\n     *)]]*-1","v":0}]
[null,null,null,null,"651G8027",0,"GRAFENTHAL SSD 2TB SATA3 6GB/S 2.5''","MTBF 1.5M HOURS TBW 300TB"," ",null,null,null,null,null,null,null,null,null,null,null,null,null,null,null,null,null,null,{"$f":"Tabelle43[[#This Row],[Menge\n     *)]]*-1","v":0},null,null,null,{"$f":"Tabelle43[[#This Row],[Menge\n     *)]]*-1","v":0}]
[null,null,null,null,"651G8010",0,"GRAFENTHAL SSD 240GB 2,5'' SFF SATA 6G","READ 320MB WRITE 300MB"," ",null,null,null,null,null,null,null,null,null,null,null,null,null,null,null,null,null,null,{"$f":"Tabelle43[[#This Row],[Menge\n     *)]]*-1","v":0},null,null,null,{"$f":"Tabelle43[[#This Row],[Menge\n     *)]]*-1","v":0}]
[null,null,null,null,"SAS",{"$f":"SUM(F72:F78)","v":0}]
[null,null,null,null,"SAS 2,5\" 10k 12GB/s",{"$f":"SUM(F64:F69)","v":0}]
[null,null,null,null,"651G8005",0,"GRAFENTHAL HDD 600GB 10K 2.5\\ SAS 12GB/S\""," "," ",null,null,null,null,null,null,null,null,null,null,null,null,null,null,null,null,null,{"$f":"Tabelle43[[#This Row],[Menge\n     *)]]*-1","v":0},null,null,null,null,{"$f":"Tabelle43[[#This Row],[Menge\n     *)]]*-1","v":0}]
[null,null,null,null,"651G8006",0,"GRAFENTHAL HDD 900GB 10K 2.5\\ SAS 12GB/S\""," "," ",null,null,null,null,null,null,null,null,null,null,null,null,null,null,null,null,null,{"$f":"Tabelle43[[#This Row],[Menge\n     *)]]*-1","v":0},null,null,null,null,{"$f":"Tabelle43[[#This Row],[Menge\n     *)]]*-1","v":0}]
[null,null,null,null,"651G8007",0,"GRAFENTHAL HDD 1.2TB 10K 2.5\\ SAS 12GB/S\""," "," ",null,null,null,null,null,null,null,null,null,null,null,null,null,null,null,null,null,{"$f":"Tabelle43[[#This Row],[Menge\n     *)]]*-1","v":0},null,null,null,null,{"$f":"Tabelle43[[#This Row],[Menge\n     *)]]*-1","v":0}]
[null,null,null,null,"651G8020",0,"GRAFENTHAL HDD 300GB 10K 2.5'' SAS","12GB/S"," ",null,null,null,null,null,null,null,null,null,null,null,null,null,null,null,null,null,{"$f":"Tabelle43[[#This Row],[Menge\n     *)]]*-1","v":0},null,null,null,null,{"$f":"Tabelle43[[#This Row],[Menge\n     *)]]*-1","v":0}]
[null,null,null,null,"651G8021",0,"GRAFENTHAL HDD 1.8TB 10K 2.5'' SAS","12GB/S"," ",null,null,null,null,null,null,null,null,null,null,null,null,null,null,null,null,null,{"$f":"Tabelle43[[#This Row],[Menge\n     *)]]*-1","v":0},null,null,null,null,{"$f":"Tabelle43[[#This Row],[Menge\n     *)]]*-1","v":0}]
[null,null,null,null,"651G8022",0,"GRAFENTHAL HDD 2.4TB 10K 2.5'' SAS","12GB/S"," ",null,null,null,null,null,null,null,null,null,null,null,null,null,null,null,null,null,{"$f":"Tabelle43[[#This Row],[Menge\n     *)]]*-1","v":0},null,null,null,null,{"$f":"Tabelle43[[#This Row],[Menge\n     *)]]*-1","v":0}]
[null,null,null,null,"SAS 2,5\" 15k 12GB/s",{"$f":"SUM(F71:F73)","v":0}]
[null,null,null,null,"651G8003",0,"GRAFENTHAL HDD 300GB 15K 2.5\\ SAS 12GB/S\""," "," ",null,null,null,null,null,null,null,null,null,null,null,null,null,null,null,null,null,{"$f":"Tabelle43[[#This Row],[Menge\n     *)]]*-1","v":0},null,null,null,null,{"$f":"Tabelle43[[#This Row],[Menge\n     *)]]*-1","v":0}]
[null,null,null,null,"651G8004",0,"GRAFENTHAL HDD 600GB 15K 2.5\\ SAS 12GB/S\""," "," ",null,null,null,null,null,null,null,null,null,null,null,null,null,null,null,null,null,{"$f":"Tabelle43[[#This Row],[Menge\n     *)]]*-1","v":0},null,null,null,null,{"$f":"Tabelle43[[#This Row],[Menge\n     *)]]*-1","v":0}]
[null,null,null,null,"651G8019",0,"GRAFENTHAL HDD 900GB 15K 2.5'' SAS","12GB/S"," ",null,null,null,null,null,null,null,null,null,null,null,null,null,null,null,null,null,{"$f":"Tabelle43[[#This Row],[Menge\n     *)]]*-1","v":0},null,null,null,null,{"$f":"Tabelle43[[#This Row],[Menge\n     *)]]*-1","v":0}]
[null,null,null,null,"SAS 2,5\" SSD  12GB/s *Midrange*",{"$f":"SUM(F75:F78)","v":0}]
[null,null,null,null,"651G7004",0,"GRAFENTHAL SSD 480GB 2,5'' SAS 12GB/S","MIDRANGE DWPD 1"," ",null,null,null,null,null,null,null,null,null,null,null,null,null,null,null,null,null,{"$f":"Tabelle43[[#This Row],[Menge\n     *)]]*-1","v":0},null,null,null,null,{"$f":"Tabelle43[[#This Row],[Menge\n     *)]]*-1","v":0}]
[null,null,null,null,"651G7005",0,"GRAFENTHAL SSD 960GB 2,5'' SAS 12GB/S","MIDRANGE DWPD 1"," ",null,null,null,null,null,null,null,null,null,null,null,null,null,null,null,null,null,{"$f":"Tabelle43[[#This Row],[Menge\n     *)]]*-1","v":0},null,null,null,null,{"$f":"Tabelle43[[#This Row],[Menge\n     *)]]*-1","v":0}]
[null,null,null,null,"651G7006",0,"GRAFENTHAL SSD 1920GB 2,5'' SAS 12GB/S","MIDRANGE DWPD 1"," ",null,null,null,null,null,null,null,null,null,null,null,null,null,null,null,null,null,{"$f":"Tabelle43[[#This Row],[Menge\n     *)]]*-1","v":0},null,null,null,null,{"$f":"Tabelle43[[#This Row],[Menge\n     *)]]*-1","v":0}]
[null,null,null,null,"651G7007",0,"GRAFENTHAL SSD 3840GB 2,5'' SAS 12GB/S","MIDRANGE DWPD 1"," ",null,null,null,null,null,null,null,null,null,null,null,null,null,null,null,null,null,{"$f":"Tabelle43[[#This Row],[Menge\n     *)]]*-1","v":0},null,null,null,null,{"$f":"Tabelle43[[#This Row],[Menge\n     *)]]*-1","v":0}]
[null,null,null,null,"U2 NVMe",{"$f":"SUM(F80:F80)","v":0}]
[null,null,null,null,"U2 2,5\" SSD NVMe",{"$f":"SUM(F81:F83)","v":0},""]
[null,null,null,null,"folgen",0,{"$error":"#N/A"},{"$error":"#N/A"},{"$error":"#N/A"},null,null,null,null,null,null,null,null,null,null,null,null,null,null,null,null,{"$f":"Tabelle43[[#This Row],[Menge\n     *)]]*-1","v":0},null,null,null,null,{"$f":"Tabelle43[[#This Row],[Menge\n     *)]]*-1","v":0},{"$f":"INT((SUM($F$81:$F$83))/2+0.5)*-4","v":0}]
[null,null,null,null,"folgen",0,{"$error":"#N/A"},{"$error":"#N/A"},{"$error":"#N/A"},null,null,null,null,null,null,null,null,null,null,null,null,null,null,null,null,{"$f":"Tabelle43[[#This Row],[Menge\n     *)]]*-1","v":0},null,null,null,null,{"$f":"Tabelle43[[#This Row],[Menge\n     *)]]*-1","v":0},"XXX"]
[null,null,null,null,"folgen",0,{"$error":"#N/A"},{"$error":"#N/A"},{"$error":"#N/A"},null,null,null,null,null,null,null,null,null,null,null,null,null,null,null,null,{"$f":"Tabelle43[[#This Row],[Menge\n     *)]]*-1","v":0},null,null,null,null,null,"XXX"]
[null,null,null,null,"U2 NVMe (OCU-link) Raid - Key",{"$f":"SUM(F85:F85)","v":0},""]
[null,null,null,null,"659G8020",0,"GRAFENTHAL INTEL RAID INTERNAL KEY","RAID 0-1-5-10"," "]
[null,null,null,null,"M.2 SATA",{"$f":"SUM(F87:F87)","v":0},""]
[null,null,null,null,"M.2 SSD SATA",{"$f":"SUM(F88:F88)","v":0}]
[null,null,null,null,"651G8023",0,"GRAFENTHAL M.2 SSD DC S3520 240GB"," "," ",null,null,null,null,null,null,null,null,null,null,{"$f":"Tabelle43[[#This Row],[Menge\n     *)]]*-1","v":0}]
[null,null,null,null,"Riser Card Expander M.2",{"$f":"SUM(F90:F90)","v":0}]
[null,null,null,null,"659G8019",{"$f":"IF(F88=0,0,1)","v":0},"GRAFENTHAL INTERNAL M.2 RISER CARD","2x SLOT"," "]
[null,null,null,null,"Riser Card Expander",{"$f":"SUM(F92:F95)","v":0}]
[null,null,null,null,"659G8016",{"$f":"IF($F$14=1,1,0)","v":0},"GRAFENTHAL PCI-E RISER CARD 3x SLOT x8"," "," ",null,null,null,null,{"$f":"Tabelle43[[#This Row],[Menge\n     *)]]*-24","v":0},{"$f":"Tabelle43[[#This Row],[Menge\n     *)]]*24","v":0},null,null,null,{"$f":"Tabelle43[[#This Row],[Menge\n     *)]]*3","v":0}]
[null,null,null,null,"659G8016",{"$f":"IF($F$14=1,1,0)","v":0},"GRAFENTHAL PCI-E RISER CARD 3x SLOT x8"," "," ",null,null,null,null,{"$f":"IF(SUM($F$16:$F$39)=2,Tabelle43[[#This Row],[Menge\n     *)]]*-24,Tabelle43[[#This Row],[Menge\n     *)]]*-8)","v":0},{"$f":"IF(SUM($F$16:$F$39)=2,Tabelle43[[#This Row],[Menge\n     *)]]*24,Tabelle43[[#This Row],[Menge\n     *)]]*8)","v":0},null,null,null,{"$f":"Tabelle43[[#This Row],[Menge\n     *)]]*3","v":0}]
[null,null,null,null,"659G8017",0,"GRAFENTHAL PCI-E RISER CARD 2x SLOT x8","FOR R2208 S3"," ",null,null,null,null,{"$f":"IF(SUM($F$16:$F$39)=2,Tabelle43[[#This Row],[Menge\n     *)]]*-16,Tabelle43[[#This Row],[Menge\n     *)]]*0)","v":0},{"$f":"IF(SUM($F$16:$F$39)=2,Tabelle43[[#This Row],[Menge\n     *)]]*16,Tabelle43[[#This Row],[Menge\n     *)]]*0)","v":0},null,null,null,{"$f":"Tabelle43[[#This Row],[Menge\n     *)]]*2","v":0}]
[null,null,null,null,"659G8018",0,"GRAFENTHAL INTERNAL PCIe RISER  2x SLOT"," "," ",null,{"$f":"IF(Tabelle43[[#This Row],[Menge\n     *)]],-1,0)","v":0}]
[null,null,null,null,"Raid Controller",{"$f":"SUM(F97:F100)","v":0},"mindestens 1 RAID Controller oder HBA benötigt"]
[null,null,null,null,"653G8000",0,"GRAFENTHAL RAID CONTROLLER PM8060 12GB","SAS 8-CH 2GB CACHE"," ",null,null,null,null,null,{"$f":"Tabelle43[[#This Row],[Menge\n     *)]]*-8","v":0},null,null,null,{"$f":"Tabelle43[[#This Row],[Menge\n     *)]]*-1","v":0},null,null,null,null,null,null,null,{"$f":"Tabelle43[[#This Row],[Menge\n     *)]]*8","v":0},null,{"$f":"Tabelle43[[#This Row],[Menge\n     *)]]*1","v":0}]
[null,null,null,null,"653G5008",0,"GRAFENTHAL RAID CONTROLLER SAS/SATA","12GB/S /6GB/S 8i NO CACHE"," ",null,null,null,null,null,{"$f":"Tabelle43[[#This Row],[Menge\n     *)]]*-8","v":0},null,null,null,{"$f":"Tabelle43[[#This Row],[Menge\n     *)]]*-1","v":0},null,null,null,null,null,null,null,{"$f":"(Tabelle43[[#This Row],[Menge\n     *)]]*8)-$F$52","v":0},{"$f":"IF($F$52=0,0,Tabelle43[[#This Row],[Menge\n     *)]]*8)","v":0}]
[null,null,null,null,"653G8002",0,"GRAFENTHAL RAID CONTROLLER SAS3108 8i","2GB CACHE"," ",null,null,null,null,null,{"$f":"Tabelle43[[#This Row],[Menge\n     *)]]*-8","v":0},null,null,null,{"$f":"Tabelle43[[#This Row],[Menge\n     *)]]*-1","v":0},null,null,null,null,null,null,null,{"$f":"Tabelle43[[#This Row],[Menge\n     *)]]*8","v":0}]
[null,null,null,null,"653G8003",0,"GRAFENTHAL RAID CONTROLLER SAS3108 16i","2GB CACHE"," ",null,null,null,null,null,{"$f":"Tabelle43[[#This Row],[Menge\n     *)]]*-8","v":0},null,null,null,{"$f":"Tabelle43[[#This Row],[Menge\n     *)]]*-1","v":0},null,null,null,null,null,null,null,{"$f":"Tabelle43[[#This Row],[Menge\n     *)]]*16","v":0}]
[null,null,null,null,"Raid Controller - Zubehör",{"$f":"SUM(F102:F102)","v":0}]
[null,null,null,null,"653G8001",0,"GRAFENTHAL RAID CONTROLLER BATTERY","BACK UP UNIT FOR 653G8000"," ",null,null,null,null,null,null,null,null,null,null,null,null,null,null,null,null,null,null,null,{"$f":"Tabelle43[[#This Row],[Menge\n     *)]]*-1","v":0}]
[null,null,null,null,"Kabel",{"$f":"SUM(F104:F110)","v":0}]
[null,null,null,"wegen","658G8000",0,"GRAFENTHAL OCULINK HDD EXPANSION CABLE","800MM"," "]
[null,null,null,"Unklarheit bei","658G8001",0,"GRAFENTHAL OCULINK HDD EXPANSION CABLE","720MM"," "]
[null,null,null,"Kabellängen noch","658G8002",0,"GRAFENTHAL I2C SIGNAL CABLE FOR FRONT","HDD EXPANSION 4150MM"," "]
[null,null,null,"nicht","658G8003",0,"GRAFENTHAL POWER CABLE FOR FRONT","HDD EXPANSION 3100MM"," "]
[null,null,null,"eingebunden","658G8004",0,"GRAFENTHAL OCULINK NVMe CABLE 620MM"," "," "]
[null,null,null,null,"658G8005",0,"GRAFENTHAL OCULINK NVMe CABLE 820MM"," "," "]
[null,null,null,null,"658G8006",0,"GRAFENTHAL OCULINK NVMe CABLE 900MM"," "," "]
[null,null,null,null,"HBA SAS",{"$f":"SUM(F112:F118)","v":0}]
[null,null,null,null,null,0,{"$error":"#N/A"},{"$error":"#N/A"},{"$error":"#N/A"},null,null,null,null,null,null,null,null,null,{"$f":"Tabelle43[[#This Row],[Menge\n     *)]]*-1","v":0}]
[null,null,null,null,null,0,{"$error":"#N/A"},{"$error":"#N/A"},{"$error":"#N/A"},null,null,null,null,null,null,null,null,null,{"$f":"Tabelle43[[#This Row],[Menge\n     *)]]*-1","v":0}]
[null,null,null,null,null,0,{"$error":"#N/A"},{"$error":"#N/A"},{"$error":"#N/A"},null,null,null,null,null,null,null,null,null,{"$f":"Tabelle43[[#This Row],[Menge\n     *)]]*-1","v":0}]
[null,null,null,null,null,0,{"$error":"#N/A"},{"$error":"#N/A"},{"$error":"#N/A"},null,null,null,null,null,null,null,null,null,{"$f":"Tabelle43[[#This Row],[Menge\n     *)]]*-1","v":0}]
[null,null,null,null,null,0,{"$error":"#N/A"},{"$error":"#N/A"},{"$error":"#N/A"},null,null,null,null,null,null,null,null,null,{"$f":"Tabelle43[[#This Row],[Menge\n     *)]]*-1","v":0}]
[null,null,null,null,null,0,{"$error":"#N/A"},{"$error":"#N/A"},{"$error":"#N/A"},null,null,null,null,null,null,null,null,null,{"$f":"Tabelle43[[#This Row],[Menge\n     *)]]*-1","v":0}]
[null,null,null,null,null,0,{"$error":"#N/A"},{"$error":"#N/A"},{"$error":"#N/A"},null,null,null,null,null,null,null,null,null,{"$f":"Tabelle43[[#This Row],[Menge\n     *)]]*-1","v":0}]
[null,null,null,null,"DVD",{"$f":"SUM(F120)","v":0}]
[null,null,null,null,null,0,{"$error":"#N/A"},{"$error":"#N/A"},{"$error":"#N/A"}]
[null,null,null,null,"(Kupfer-) Netzkarte",{"$f":"SUM(F122:F123)","v":0}]
[null,null,null,null,"659G8015",0,"GRAFENTHAL GIGABIT ETHERNET APDATER","I350-T4V2 4x RJ-45 PCIe x4 COPPER"," ",null,null,null,null,null,null,null,null,null,{"$f":"Tabelle43[[#This Row],[Menge\n     *)]]*-1","v":0}]
[null,null,null,null,"653G7002",0,"GRAFENTHAL ETHERNET ADAPTER DUAL PORT","RJ45 2x10GBE X550-T2 PCIe 3.0 x4"," ",null,null,null,null,null,null,null,null,null,{"$f":"Tabelle43[[#This Row],[Menge\n     *)]]*-1","v":0}]
[null,null,null,null,"(Kupfer-) Netzkarte - PHY-card",{"$f":"SUM(F125:F125)","v":0}]
[null,null,null,null,"653G8004",0,"GRAFENTHAL ETHERNET CARD PHY 4x1GB/S","COPPER FOR R2208 S3 / R2216 S3"," ",null,null,null,null,null,null,null,null,null,null,null,null,null,null,null,null,null,null,null,null,null,null,null,null,null,{"$f":"Tabelle43[[#This Row],[Menge\n     *)]]*-1","v":0}]
[null,null,null,null,"(SFP+)Netzwerkkarte",{"$f":"SUM(F127:F128)","v":0}]
[null,null,null,null,"653G7000",0,"GRAFENTHAL ETHERNET ADAPTER DUAL PORT","QSFP+ 2x10GBE/40GBE PCIe 3.0 x8 XL710-QD"," ",null,null,null,null,null,null,null,null,null,{"$f":"Tabelle43[[#This Row],[Menge\n     *)]]*-1","v":0}]
[null,null,null,"low profile!","653G7003",0,"GRAFENTHAL ETHERNET ADAPTER 2-PORT 10GBE","INTEL X520 FIBRE SFP+ PCIe x8 LP"," ",null,null,null,null,null,null,null,null,null,{"$f":"Tabelle43[[#This Row],[Menge\n     *)]]*-1","v":0}]
[null,null,null,null,"Glasfaserkarten",{"$f":"SUM(F130:F131)","v":0}]
[null,null,null,"soll ich die 653G7003 hier aufnehmen?",null,0,{"$error":"#N/A"},{"$error":"#N/A"},{"$error":"#N/A"},null,null,null,null,null,null,null,null,null,{"$f":"Tabelle43[[#This Row],[Menge\n     *)]]*-1","v":0}]
[null,null,null,null,null,0,{"$error":"#N/A"},{"$error":"#N/A"},{"$error":"#N/A"},null,null,null,null,null,null,null,null,null,{"$f":"Tabelle43[[#This Row],[Menge\n     *)]]*-1","v":0}]
[null,null,null,null,"PSU",{"$f":"SUM(F133:F135)","v":0}]
[null,null,null,null,"654G8001",{"$f":"IF(SUM(F14:F14)>0,IF(SUM(F135:F135)>0,0,1),0)","v":0},"GRAFENTHAL PSU 800W PLATINUM RED","FOR R2208 S3 / R2216 S3"," ",null,null,null,null,null,null,null,null,null,null,null,null,null,null,null,null,null,null,null,null,null,null,null,null,{"$f":"Tabelle43[[#This Row],[Menge\n     *)]]*-1","v":0}]
[null,null,null,null,"654G8001",0,"GRAFENTHAL PSU 800W PLATINUM RED","FOR R2208 S3 / R2216 S3"," ",null,null,null,null,null,null,null,null,null,null,null,null,null,null,null,null,null,null,null,null,null,null,null,null,{"$f":"Tabelle43[[#This Row],[Menge\n     *)]]*-1","v":0}]
[null,null,null,null,"654G8002",0,"GRAFENTHAL PSU 1300W PLATINUM RED"," "," ",null,null,null,null,null,null,null,null,null,null,null,null,null,null,null,null,null,null,null,null,null,null,null,null,{"$f":"Tabelle43[[#This Row],[Menge\n     *)]]*-1","v":0}]
[null,null,null,null,"Open-E",{"$f":"SUM(F137:F148)","v":0}]
[null,null,null,null,1701,0,"OPEN-E DSS V7 STORAGE SOFTWARE OS, 4TB"," "]
[null,null,null,null,1702,0,"OPEN-E DSS V7 STORAGE SOFTWARE OS, 8TB"," "]
[null,null,null,null,1703,0,"OPEN-E DSS V7 STORAGE SOFTWARE OS, 16TB"," "]
[null,null,null,null,1704,0,"OPEN-E DSS V7 STORAGE SOFTWARE OS,","UNLIMITED TB"]
[null,null,null,null,1719,0,"OPEN-E FEATURE PACK-ACTIVE iSCSI,","FAILOVER V7 ONLY TWO LICENSE KEY"]
[null,null,null,null,1775,0,"OPEN-E STANDARD SUPPORT, 1 YEAR,","8 BUSINESS HR PHONE OR EMAIL"]
[null,null,null,null,1776,0,"OPEN-E PREMIUM SUPPORT, 1 YEAR","4 BUSINESS HR PHONE EMAIL REMOTE CONSOLE"]
[null,null,null,null,1777,0,"OPEN-E 24/7 SUPPORT,3 YEARS,4 BUSI. HR.","UP TO 4H AFTER SUBMISSION OF TICKET"]
[null,null,null,null,1778,0,"OPEN-E UPGRADE TO 3 YEARS BASIC SUPPORT"," "]
[null,null,null,null,1779,0,"OPEN-E UPGRADE TO 3 YEARS STANDARD","SUPPORT"]
[null,null,null,null,1780,0,"OPEN-E UPGRADE TO 3 YEARS PREMIUM","SUPPORT"]
[null,null,null,null,1781,0,"OPEN-E 24/7 SUPPORT,3 YEARS,4 BUSI. HR.","UP TO 4H AFTER SUBMISSION OF TICKET"]
[null,null,null,null,"MPAC",{"$f":"SUM(F150:F185)","v":0}]
[null,null,null,null,"740M6037",0,"GRAFENTHAL MPAC VOR ORT SERVICE UPGRADE","3JAHRE 13x5 24STD  WIEDERHERSTELLUNG","FÜR GRAFENTHAL R2208 S2 AB E5-2650"]
[null,null,null,null,"740M6038",0,"GRAFENTHAL MPAC VOR ORT SERVICE UPGRADE","3JAHRE 13x5 12STD  WIEDERHERSTELLUNG FÜR","FÜR GRAFENTHAL R2208 S2 AB E5-2650"]
[null,null,null,null,"740M6039",0,"GRAFENTHAL MPAC VOR ORT SERVICE UPGRADE","3JAHRE 24x7 6 STD  WIEDERHERSTELLUNG FÜR","FÜR GRAFENTHAL R2208 S2 AB E5-2650"]
[null,null,null,null,"740M6040",0,"GRAFENTHAL MPAC VOR ORT SERVICE UPGRADE","4JAHRE 13x5 24STD  WIEDERHERSTELLUNG FÜR","FÜR GRAFENTHAL R2208 S2 AB E5-2650"]
[null,null,null,null,"740M6041",0,"GRAFENTHAL MPAC VOR ORT SERVICE UPGRADE","4JAHRE 13x5 12STD  WIEDERHERSTELLUNG FÜR","FÜR GRAFENTHAL R2208 S2 AB E5-2650"]
[null,null,null,null,"740M6042",0,"GRAFENTHAL MPAC VOR ORT SERVICE UPGRADE","4JAHRE 24x7 6 STD  WIEDERHERSTELLUNG FÜR","FÜR GRAFENTHAL R2208 S2 AB E5-2650"]
[null,null,null,null,"740M6043",0,"GRAFENTHAL MPAC VOR ORT SERVICE UPGRADE","5JAHRE 13x5 24STD  WIEDERHERSTELLUNG FÜR","FÜR GRAFENTHAL R2208 S2 AB E5-2650"]
[null,null,null,null,"740M6044",0,"GRAFENTHAL MPAC VOR ORT SERVICE UPGRADE","5JAHRE 13x5 12STD  WIEDERHERSTELLUNG FÜR","FÜR GRAFENTHAL R2208 S2 AB E5-2650"]
[null,null,null,null,"740M6045",0,"GRAFENTHAL MPAC VOR ORT SERVICE UPGRADE","5JAHRE 24x7 6 STD  WIEDERHERSTELLUNG FÜR","FÜR GRAFENTHAL R2208 S2 AB E5-2650"]
[null,null,null,null,"740M6088",0,"GRAFENTHAL MPAC VOR ORT SERVICE UPGRADE","3JAHRE 13x5 24STD  WIEDERHERSTELLUNG DMR","FÜR GRAFENTHAL R2208 S2 AB E5-2650"]
[null,null,null,null,"740M6089",0,"GRAFENTHAL MPAC VOR ORT SERVICE UPGRADE","3JAHRE 13x5 12STD  WIEDERHERSTELLUNG DMR","FÜR GRAFENTHAL R2208 S2 AB E5-2650"]
[null,null,null,null,"740M6090",0,"GRAFENTHAL MPAC VOR ORT SERVICE UPGRADE","3JAHRE 24x7 6 STD  WIEDERHERSTELLUNG DMR","FÜR GRAFENTHAL R2208 S2 AB E5-2650"]
[null,null,null,null,"740M6091",0,"GRAFENTHAL MPAC VOR ORT SERVICE UPGRADE","4JAHRE 13x5 24STD  WIEDERHERSTELLUNG DMR","FÜR GRAFENTHAL R2208 S2 AB E5-2650"]
[null,null,null,null,"740M6092",0,"GRAFENTHAL MPAC VOR ORT SERVICE UPGRADE","4JAHRE 13x5 12STD  WIEDERHERSTELLUNG DMR","FÜR GRAFENTHAL R2208 S2 AB E5-2650"]
[null,null,null,null,"740M6093",0,"GRAFENTHAL MPAC VOR ORT SERVICE UPGRADE","4JAHRE 24x7 6 STD  WIEDERHERSTELLUNG DMR","FÜR GRAFENTHAL R2208 S2 AB E5-2650"]
[null,null,null,null,"740M6094",0,"GRAFENTHAL MPAC VOR ORT SERVICE UPGRADE","5JAHRE 13x5 24STD  WIEDERHERSTELLUNG DMR","FÜR GRAFENTHAL R2208 S2 AB E5-2650"]
[null,null,null,null,"740M6095",0,"GRAFENTHAL MPAC VOR ORT SERVICE UPGRADE","5JAHRE 13x5 12STD  WIEDERHERSTELLUNG DMR","FÜR GRAFENTHAL R2208 S2 AB E5-2650"]
[null,null,null,null,"740M6096",0,"GRAFENTHAL MPAC VOR ORT SERVICE UPGRADE","5JAHRE 24x7 6 STD  WIEDERHERSTELLUNG DMR","FÜR GRAFENTHAL R2208 S2 AB E5-2650"]
[null,null,null,null,"740M6028",0,"GRAFENTHAL MPAC VOR ORT SERVICE UPGRADE","3JAHRE 13x5 24STD  WIEDERHERSTELLUNG FÜR","FÜR GRAFENTHAL R2208 S2 BIS E5-264X"]
[null,null,null,null,"740M6029",0,"GRAFENTHAL MPAC VOR ORT SERVICE UPGRADE","3JAHRE 13x5 12STD  WIEDERHERSTELLUNG FÜR","FÜR GRAFENTHAL R2208 S2 BIS E5-264X"]
[null,null,null,null,"740M6030",0,"GRAFENTHAL MPAC VOR ORT SERVICE UPGRADE","3JAHRE 24x7 6 STD  WIEDERHERSTELLUNG FÜR","FÜR GRAFENTHAL R2208 S2 BIS E5-264X"]
[null,null,null,null,"740M6031",0,"GRAFENTHAL MPAC VOR ORT SERVICE UPGRADE","4JAHRE 13x5 24STD  WIEDERHERSTELLUNG FÜR","FÜR GRAFENTHAL R2208 S2 BIS E5-264X"]
[null,null,null,null,"740M6032",0,"GRAFENTHAL MPAC VOR ORT SERVICE UPGRADE","4JAHRE 13x5 12STD  WIEDERHERSTELLUNG FÜR","FÜR GRAFENTHAL R2208 S2 BIS E5-264X"]
[null,null,null,null,"740M6033",0,"GRAFENTHAL MPAC VOR ORT SERVICE UPGRADE","4JAHRE 24x7 6 STD  WIEDERHERSTELLUNG FÜR","FÜR GRAFENTHAL R2208 S2 BIS E5-264X"]
[null,null,null,null,"740M6034",0,"GRAFENTHAL MPAC VOR ORT SERVICE UPGRADE","5JAHRE 13x5 24STD  WIEDERHERSTELLUNG FÜR","FÜR GRAFENTHAL R2208 S2 BIS E5-264X"]
[null,null,null,null,"740M6035",0,{"$f":"VLOOKUP(TEXT(E175,\"0\"),[1]Stammdaten!A:AH,3,FALSE)","v":"GRAFENTHAL MPAC VOR ORT SERVICE UPGRADE"},{"$f":"VLOOKUP(TEXT(E175,\"0\"),[1]Stammdaten!A:AH,4,FALSE)","v":"5JAHRE 13x5 12STD  WIEDERHERSTELLUNG FÜR"},{"$f":"VLOOKUP(E175,[1]Stammdaten!A:AH,5,FALSE)","v":"FÜR GRAFENTHAL R2208 S2 BIS E5-264X"}]
[null,null,null,null,"740M6036",0,{"$f":"VLOOKUP(TEXT(E176,\"0\"),[1]Stammdaten!A:AH,3,FALSE)","v":"GRAFENTHAL MPAC VOR ORT SERVICE UPGRADE"},{"$f":"VLOOKUP(TEXT(E176,\"0\"),[1]Stammdaten!A:AH,4,FALSE)","v":"5JAHRE 24x7 6 STD  WIEDERHERSTELLUNG FÜR"},{"$f":"VLOOKUP(E176,[1]Stammdaten!A:AH,5,FALSE)","v":"FÜR GRAFENTHAL R2208 S2 BIS E5-264X"}]
[null,null,null,null,"740M6079",0,{"$f":"VLOOKUP(TEXT(E177,\"0\"),[1]Stammdaten!A:AH,3,FALSE)","v":"GRAFENTHAL MPAC VOR ORT SERVICE UPGRADE"},{"$f":"VLOOKUP(TEXT(E177,\"0\"),[1]Stammdaten!A:AH,4,FALSE)","v":"3JAHRE 13x5 24STD  WIEDERHERSTELLUNG DMR"},{"$f":"VLOOKUP(E177,[1]Stammdaten!A:AH,5,FALSE)","v":"FÜR GRAFENTHAL R2208 S2 BIS E5-264X"}]
[null,null,null,null,"740M6080",0,{"$f":"VLOOKUP(TEXT(E178,\"0\"),[1]Stammdaten!A:AH,3,FALSE)","v":"GRAFENTHAL MPAC VOR ORT SERVICE UPGRADE"},{"$f":"VLOOKUP(TEXT(E178,\"0\"),[1]Stammdaten!A:AH,4,FALSE)","v":"3JAHRE 13x5 12STD  WIEDERHERSTELLUNG DMR"},{"$f":"VLOOKUP(E178,[1]Stammdaten!A:AH,5,FALSE)","v":"FÜR GRAFENTHAL R2208 S2 BIS E5-264X"}]
[null,null,null,null,"740M6081",0,{"$f":"VLOOKUP(TEXT(E179,\"0\"),[1]Stammdaten!A:AH,3,FALSE)","v":"GRAFENTHAL MPAC VOR ORT SERVICE UPGRADE"},{"$f":"VLOOKUP(TEXT(E179,\"0\"),[1]Stammdaten!A:AH,4,FALSE)","v":"3JAHRE 24x7 6 STD  WIEDERHERSTELLUNG DMR"},{"$f":"VLOOKUP(E179,[1]Stammdaten!A:AH,5,FALSE)","v":"FÜR GRAFENTHAL R2208 S2 BIS E5-264X"}]
[null,null,null,null,"740M6082",0,{"$f":"VLOOKUP(TEXT(E180,\"0\"),[1]Stammdaten!A:AH,3,FALSE)","v":"GRAFENTHAL MPAC VOR ORT SERVICE UPGRADE"},{"$f":"VLOOKUP(TEXT(E180,\"0\"),[1]Stammdaten!A:AH,4,FALSE)","v":"4JAHRE 13x5 24STD  WIEDERHERSTELLUNG DMR"},{"$f":"VLOOKUP(E180,[1]Stammdaten!A:AH,5,FALSE)","v":"FÜR GRAFENTHAL R2208 S2 BIS E5-264X"}]
[null,null,null,null,"740M6083",0,{"$f":"VLOOKUP(TEXT(E181,\"0\"),[1]Stammdaten!A:AH,3,FALSE)","v":"GRAFENTHAL MPAC VOR ORT SERVICE UPGRADE"},{"$f":"VLOOKUP(TEXT(E181,\"0\"),[1]Stammdaten!A:AH,4,FALSE)","v":"4JAHRE 13x5 12STD  WIEDERHERSTELLUNG DMR"},{"$f":"VLOOKUP(E181,[1]Stammdaten!A:AH,5,FALSE)","v":"FÜR GRAFENTHAL R2208 S2 BIS E5-264X"}]
[null,null,null,null,"740M6084",0,{"$f":"VLOOKUP(TEXT(E182,\"0\"),[1]Stammdaten!A:AH,3,FALSE)","v":"GRAFENTHAL MPAC VOR ORT SERVICE UPGRADE"},{"$f":"VLOOKUP(TEXT(E182,\"0\"),[1]Stammdaten!A:AH,4,FALSE)","v":"4JAHRE 24x7 6 STD  WIEDERHERSTELLUNG DMR"},{"$f":"VLOOKUP(E182,[1]Stammdaten!A:AH,5,FALSE)","v":"FÜR GRAFENTHAL R2208 S2 BIS E5-264X"}]
[null,null,null,null,"740M6085",0,{"$f":"VLOOKUP(TEXT(E183,\"0\"),[1]Stammdaten!A:AH,3,FALSE)","v":"GRAFENTHAL MPAC VOR ORT SERVICE UPGRADE"},{"$f":"VLOOKUP(TEXT(E183,\"0\"),[1]Stammdaten!A:AH,4,FALSE)","v":"5JAHRE 13x5 24STD  WIEDERHERSTELLUNG DMR"},{"$f":"VLOOKUP(E183,[1]Stammdaten!A:AH,5,FALSE)","v":"FÜR GRAFENTHAL R2208 S2 BIS E5-264X"}]
[null,null,null,null,"740M6086",0,{"$f":"VLOOKUP(TEXT(E184,\"0\"),[1]Stammdaten!A:AH,3,FALSE)","v":"GRAFENTHAL MPAC VOR ORT SERVICE UPGRADE"},{"$f":"VLOOKUP(TEXT(E184,\"0\"),[1]Stammdaten!A:AH,4,FALSE)","v":"5JAHRE 13x5 12STD  WIEDERHERSTELLUNG DMR"},{"$f":"VLOOKUP(E184,[1]Stammdaten!A:AH,5,FALSE)","v":"FÜR GRAFENTHAL R2208 S2 BIS E5-264X"}]
[null,null,null,null,"740M6087",0,{"$f":"VLOOKUP(TEXT(E185,\"0\"),[1]Stammdaten!A:AH,3,FALSE)","v":"GRAFENTHAL MPAC VOR ORT SERVICE UPGRADE"},{"$f":"VLOOKUP(TEXT(E185,\"0\"),[1]Stammdaten!A:AH,4,FALSE)","v":"5JAHRE 24x7 6 STD  WIEDERHERSTELLUNG DMR"},{"$f":"VLOOKUP(E185,[1]Stammdaten!A:AH,5,FALSE)","v":"FÜR GRAFENTHAL R2208 S2 BIS E5-264X"}]
[null,null,null,null,"CONFIG-TO-ORDER",{"$f":"SUM(F187:F190)","v":0}]
[null,null,null,null,"CTO",0,"HARDWARE ASSEMBLIERUNG"]
[null,null,null,null,"CTO1",0,"HARDWARE ASSEMBLIERUNG & FIRMWARE UPDATE"]
[null,null,null,null,"CTO2",0,"HARDWARE ASSEMBLIERUNG, FIRMWARE UPDATE & RAID EINRICHTUNG"]
[null,null,null,null,"CTO3",0,"HARDWARE ASSEMBLIERUNG, FIRMWARE UPDATE, RAID EINRICHTUNG & OS INSTALLATION"]
[null,null,null,null,"USB Drive",{"$f":"SUM(F192:F192)","v":0}]
[null,null,null,null,"652G6004",0,{"$f":"VLOOKUP(E192,[1]Stammdaten!A:AH,3,FALSE)","v":"GRAFENTHAL USB 3.0 FLASH DRIVE"},{"$f":"VLOOKUP(E192,[1]Stammdaten!A:AH,4,FALSE)","v":"ULTRA FIT 64GB UP TO 150MB/S"},{"$f":"VLOOKUP(E192,[1]Stammdaten!A:AH,5,FALSE)","v":" "}]
[null,null,null,null,"USV- Systeme",{"$f":"SUM(F194:F197)","v":0}]
[null,null,null,null,"132G0150",0,{"$f":"VLOOKUP(E194,[1]Stammdaten!A:AH,3,FALSE)","v":"GRAFENTHAL USV ETR-1500 TOWER RACK LINE"},{"$f":"VLOOKUP(E194,[1]Stammdaten!A:AH,4,FALSE)","v":"INTERACTIVE 1500VA 1200W PURE SINEWAVE"},{"$f":"VLOOKUP(E194,[1]Stammdaten!A:AH,5,FALSE)","v":"ECO MODE 23KG CE ROHS GERMAN"}]
[null,null,null,null,"132G0300",0,{"$f":"VLOOKUP(E195,[1]Stammdaten!A:AH,3,FALSE)","v":"GRAFENTHAL USV ETR-3000 TOWER RACK LINE"},{"$f":"VLOOKUP(E195,[1]Stammdaten!A:AH,4,FALSE)","v":"INTERACTIVE 3000VA 2400W PURE SINEWAVE"},{"$f":"VLOOKUP(E195,[1]Stammdaten!A:AH,5,FALSE)","v":"ECO MODE 35KG CE ROHS GERMAN"}]
[null,null,null,null,"113G1150",0,{"$f":"VLOOKUP(E196,[1]Stammdaten!A:AH,3,FALSE)","v":"GRAFENTHAL USV PR-1500-HS PROGRAMMABLE"},{"$f":"VLOOKUP(E196,[1]Stammdaten!A:AH,4,FALSE)","v":"ECO MODE RACK MOUNT 2U USB RS232 LCD"},{"$f":"VLOOKUP(E196,[1]Stammdaten!A:AH,5,FALSE)","v":" "}]
[null,null,null,null,"113G1300",0,{"$f":"VLOOKUP(E197,[1]Stammdaten!A:AH,3,FALSE)","v":"GRAFENTHAL USV PR-3000-HS ONLINE"},{"$f":"VLOOKUP(E197,[1]Stammdaten!A:AH,4,FALSE)","v":"ECO MODE RACK MOUNT 2U USB RS232 LCD"},{"$f":"VLOOKUP(E197,[1]Stammdaten!A:AH,5,FALSE)","v":" "}]
[null,null,null,null,"USV- Zubehör",{"$f":"SUM(F199:F200)","v":0}]
[null,null,null,null,"149G6005",0,{"$f":"VLOOKUP(E199,[1]Stammdaten!A:AH,3,FALSE)","v":"GRAFENTHAL USV SNMP CARD PRO S2"},{"$f":"VLOOKUP(E199,[1]Stammdaten!A:AH,4,FALSE)","v":"FOR ETR AND PR AND PTR SERIES"},{"$f":"VLOOKUP(E199,[1]Stammdaten!A:AH,5,FALSE)","v":"MULTI SERVER SHUTDOWN"}]
[null,null,null,null,"149G5003",0,{"$f":"VLOOKUP(E200,[1]Stammdaten!A:AH,3,FALSE)","v":"GRAFENTHAL USV ACCESSORY LICENSE FOR"},{"$f":"VLOOKUP(E200,[1]Stammdaten!A:AH,4,FALSE)","v":"SNMP PRO CARD FOR ETR AND PR SERIES"},{"$f":"VLOOKUP(E200,[1]Stammdaten!A:AH,5,FALSE)","v":"MULTI SERVER SHUTDOWN"}]
[null,null,null,null,"SUMME",1,null,null,null,{"$f":"COUNTIF($J$202:$AI$202,\"<0\")","v":0}]
[null,null,null,null,null,null,null,null,null,{"$f":"SUM(J14:J200)","v":0},0,0,0,0,0,0,0,0,0,0,0,0,0,0,0,0,{"$f":"SUM(AA14:AA200)","v":0},0,0,0,0,0,0,0,0]

{"sheet":"R2210 S2","index":10,"n_rows":174,"n_cols":32,"rows_kept":174,"cut":false,"hidden":false,"merged":[[0,4,0,8]]}
[null,null,null,null,"2U Rackserver R2210 S2"]
[]
[null,null,null,null,null,null,null,"Intel® Xeon® E5-2600 v3 Produktfamilie","more info"]
[null,null,null,null,null,null,null,"bis 1,28 TB Arbeitsspeicher"]
[null,null,null,null,null,null,null,"10x HDD / SSD Bays für SAS und SATA Medien im 3,5“ und 2,5“ Format"]
[null,null,null,null,null,null,null,"Dual Gigabit Ethernet"]
[null,null,null,null,null,null,null,"Integrierter Remote-Management-Controller"]
[null,null,null,null,null,null,null,"Redundante Platinum Netzteile","* Felder werden automatisch ausgefüllt"]
[null,null,null,null,null,null,null,null,"*) \"Menge\" filtern um Konfiguration anzuzeigen"]
[]
[null,null,null,null,"Konfigurator",null,{"$f":"'Revision Info'!B10","v":"Revision 15"}]
[null,null,null,null,"ART. NR.","Menge\n    *)","Bezeichnung","Bezeichnung II","Bezeichnung III","nicht kombinierbar","nicht konfigurierbar","CPU slots","MEM Slots","SSD Slots","HDD Slots HS 2.5","HDD Slots HS 3.5","HDD Slots HS SAS","HDD Slots HS SATA","HDD Slots NHS SAS","HDD Slots NHS SATA","SAS Ports","CacheCade","3,5 Slots","Open-E","PCI x1 Slots","PCI x4 Slots","PCI x8 Slots","PCI x16 Slots","DVD Slot","PSU Slot","HDD Slots","Bckpl Slot Rear"]
[null,null,null,null,"Maschinentyp",{"$f":"SUM(F14:F14)","v":0},null,null,null,"if (Kombi);-1;0","if Menge;-1;0","Menge x Eigenschaft","(Menge x Eigenschaft)","(Menge x Eigenschaft)","(Menge x Eigenschaft)","(Menge x Eigenschaft)","(Menge x Eigenschaft)","(Menge x Eigenschaft)","(Menge x Eigenschaft)","(Menge x Eigenschaft)","(Menge x Eigenschaft)","(Menge x Eigenschaft)","(Menge x Eigenschaft)","(Menge x Eigenschaft)","(Menge x Eigenschaft)","(Menge x Eigenschaft)","(Menge x Eigenschaft)","(Menge x Eigenschaft)","(Menge x Eigenschaft)","(Menge x Eigenschaft)","(Menge x Eigenschaft)","(Menge x Eigenschaft)"]
[null,null,null,null,"612G6202",0,"GRAFENTHAL CTO RACK SERVER 2U R2210 S2","2xE5-2600V4 SOCKETS 8x3,5\\ 2x2,5\\\" 20x\"","MEM SOCKETS REMOTE RED PSU 800W",null,null,{"$f":"Tabelle47[[#This Row],[Menge\n    *)]]*2","v":0},{"$f":"Tabelle47[[#This Row],[Menge\n    *)]]*0","v":0},{"$f":"Tabelle47[[#This Row],[Menge\n    *)]]*0","v":0},{"$f":"Tabelle47[[#This Row],[Menge\n    *)]]*0","v":0},{"$f":"Tabelle47[[#This Row],[Menge\n    *)]]*0","v":0},{"$f":"Tabelle47[[#This Row],[Menge\n    *)]]*0","v":0},{"$f":"Tabelle47[[#This Row],[Menge\n    *)]]*0","v":0},{"$f":"Tabelle47[[#This Row],[Menge\n    *)]]*0","v":0},{"$f":"Tabelle47[[#This Row],[Menge\n    *)]]*0","v":0},{"$f":"Tabelle47[[#This Row],[Menge\n    *)]]*0","v":0},{"$f":"Tabelle47[[#This Row],[Menge\n    *)]]*0","v":0},{"$f":"Tabelle47[[#This Row],[Menge\n    *)]]*0","v":0},{"$f":"Tabelle47[[#This Row],[Menge\n    *)]]*1","v":0},{"$f":"Tabelle47[[#This Row],[Menge\n    *)]]*0","v":0},{"$f":"Tabelle47[[#This Row],[Menge\n    *)]]*0","v":0},{"$f":"Tabelle47[[#This Row],[Menge\n    *)]]*0","v":0},{"$f":"Tabelle47[[#This Row],[Menge\n    *)]]*0","v":0},{"$f":"Tabelle47[[#This Row],[Menge\n    *)]]*1","v":0},{"$f":"Tabelle47[[#This Row],[Menge\n    *)]]*0","v":0},{"$f":"Tabelle47[[#This Row],[Menge\n    *)]]*10","v":0},{"$f":"Tabelle47[[#This Row],[Menge\n    *)]]*1","v":0}]
[null,null,null,null,"Prozessor",{"$f":"SUM(F16:F16)","v":0}]
[null,null,null,null,"656G6002",0,"GRAFENTHAL CPU XEON E5-2603 V3 6CORE","1,6GHz LGA2011V3 15MB CACHE 6 THREADS"," ",{"$f":"IF(COUNTIF($F$16,\"<>0\")+COUNTIF($F$18:$F$28,\"<>0\")>1,-1,0)","v":0},null,{"$f":"Tabelle47[[#This Row],[Menge\n    *)]]*-1","v":0},{"$f":"Tabelle47[[#This Row],[Menge\n    *)]]*10","v":0},"X","X","X","X","X","X","X","X","X","X",{"$f":"Tabelle47[[#This Row],[Menge\n    *)]]*1","v":0},{"$f":"Tabelle47[[#This Row],[Menge\n    *)]]*3","v":0},{"$f":"Tabelle47[[#This Row],[Menge\n    *)]]*3","v":0},{"$f":"Tabelle47[[#This Row],[Menge\n    *)]]*3","v":0},{"$f":"Tabelle47[[#This Row],[Menge\n    *)]]*1.5","v":0},"X","X","X","X"]
[null,null,null,null,"V4 Prozessoren",{"$f":"SUM(F18:F28)","v":0}]
[null,null,null,null,"656G6016",0,"GRAFENTHAL CPU XEON E5-2637 V4 4CORE","3,5Ghz LGA2011V3 15MB CACHE 8 THREADS"," ",null,null,{"$f":"Tabelle47[[#This Row],[Menge\n    *)]]*-1","v":0},{"$f":"Tabelle47[[#This Row],[Menge\n    *)]]*10","v":0},"X","X","X","X","X","X","X","X","X","X","X",{"$f":"Tabelle47[[#This Row],[Menge\n    *)]]*3","v":0},{"$f":"Tabelle47[[#This Row],[Menge\n    *)]]*3","v":0},{"$f":"Tabelle47[[#This Row],[Menge\n    *)]]*3","v":0},{"$f":"Tabelle47[[#This Row],[Menge\n    *)]]*1.5","v":0},"X","X","X","X"]
[null,null,null,null,"656G6017",0,"GRAFENTHAL CPU XEON E5-2603 V4 6CORE","1,7Ghz LGA2011V3 15MB CACHE 6 THREADS"," ",null,null,{"$f":"Tabelle47[[#This Row],[Menge\n    *)]]*-1","v":0},{"$f":"Tabelle47[[#This Row],[Menge\n    *)]]*10","v":0},"X","X","X","X","X","X","X","X","X","X","X",{"$f":"Tabelle47[[#This Row],[Menge\n    *)]]*3","v":0},{"$f":"Tabelle47[[#This Row],[Menge\n    *)]]*3","v":0},{"$f":"Tabelle47[[#This Row],[Menge\n    *)]]*3","v":0},{"$f":"Tabelle47[[#This Row],[Menge\n    *)]]*1.5","v":0},"X","X","X","X"]
[null,null,null,null,"656G6018",0,"GRAFENTHAL CPU XEON E5-2609 V4 8CORE","1,7Ghz LGA2011V3 20MB CACHE 8 THREADS"," ",null,null,{"$f":"Tabelle47[[#This Row],[Menge\n    *)]]*-1","v":0},{"$f":"Tabelle47[[#This Row],[Menge\n    *)]]*10","v":0},"X","X","X","X","X","X","X","X","X","X","X",{"$f":"Tabelle47[[#This Row],[Menge\n    *)]]*3","v":0},{"$f":"Tabelle47[[#This Row],[Menge\n    *)]]*3","v":0},{"$f":"Tabelle47[[#This Row],[Menge\n    *)]]*3","v":0},{"$f":"Tabelle47[[#This Row],[Menge\n    *)]]*1.5","v":0},"X","X","X","X"]
[null,null,null,null,"656G6019",0,"GRAFENTHAL CPU XEON E5-2620 V4 8CORE","2,1GHz LGA2011V3 20MB CACHE 16 THREADS"," ",null,null,{"$f":"Tabelle47[[#This Row],[Menge\n    *)]]*-1","v":0},{"$f":"Tabelle47[[#This Row],[Menge\n    *)]]*10","v":0},"X","X","X","X","X","X","X","X","X","X","X",{"$f":"Tabelle47[[#This Row],[Menge\n    *)]]*3","v":0},{"$f":"Tabelle47[[#This Row],[Menge\n    *)]]*3","v":0},{"$f":"Tabelle47[[#This Row],[Menge\n    *)]]*3","v":0},{"$f":"Tabelle47[[#This Row],[Menge\n    *)]]*1.5","v":0},"X","X","X","X"]
[null,null,null,null,"656G6020",0,"GRAFENTHAL CPU XEON E5-2630v4 2.20GHz","10C 25MB 85W"," ",null,null,{"$f":"Tabelle47[[#This Row],[Menge\n    *)]]*-1","v":0},{"$f":"Tabelle47[[#This Row],[Menge\n    *)]]*10","v":0},"X","X","X","X","X","X","X","X","X","X","X",{"$f":"Tabelle47[[#This Row],[Menge\n    *)]]*3","v":0},{"$f":"Tabelle47[[#This Row],[Menge\n    *)]]*3","v":0},{"$f":"Tabelle47[[#This Row],[Menge\n    *)]]*3","v":0},{"$f":"Tabelle47[[#This Row],[Menge\n    *)]]*1.5","v":0},"X","X","X","X"]
[null,null,null,null,"656G6021",0,"GRAFENTHAL CPU XEON E5-2640 V4 10CORE","2,4Ghz LGA2011V3 25MB CACHE 20 THREADS"," ",null,null,{"$f":"Tabelle47[[#This Row],[Menge\n    *)]]*-1","v":0},{"$f":"Tabelle47[[#This Row],[Menge\n    *)]]*10","v":0},"X","X","X","X","X","X","X","X","X","X","X",{"$f":"Tabelle47[[#This Row],[Menge\n    *)]]*3","v":0},{"$f":"Tabelle47[[#This Row],[Menge\n    *)]]*3","v":0},{"$f":"Tabelle47[[#This Row],[Menge\n    *)]]*3","v":0},{"$f":"Tabelle47[[#This Row],[Menge\n    *)]]*1.5","v":0},"X","X","X","X"]
[null,null,null,null,"656G6022",0,"GRAFENTHAL CPU XEON E5-2650 V4 12CORE","2,2Ghz LGA2011V3 30MB CACHE 24 THREADS"," ",null,null,{"$f":"Tabelle47[[#This Row],[Menge\n    *)]]*-1","v":0},{"$f":"Tabelle47[[#This Row],[Menge\n    *)]]*10","v":0},"X","X","X","X","X","X","X","X","X","X","X",{"$f":"Tabelle47[[#This Row],[Menge\n    *)]]*3","v":0},{"$f":"Tabelle47[[#This Row],[Menge\n    *)]]*3","v":0},{"$f":"Tabelle47[[#This Row],[Menge\n    *)]]*3","v":0},{"$f":"Tabelle47[[#This Row],[Menge\n    *)]]*1.5","v":0},"X","X","X","X"]
[null,null,null,null,"656G6023",0,"GRAFENTHAL CPU XEON E5-2660 V4 14CORE","2,0Ghz LGA2011V3 35MB CACHE 28 THREADS"," ",null,null,{"$f":"Tabelle47[[#This Row],[Menge\n    *)]]*-1","v":0},{"$f":"Tabelle47[[#This Row],[Menge\n    *)]]*10","v":0},"X","X","X","X","X","X","X","X","X","X","X",{"$f":"Tabelle47[[#This Row],[Menge\n    *)]]*3","v":0},{"$f":"Tabelle47[[#This Row],[Menge\n    *)]]*3","v":0},{"$f":"Tabelle47[[#This Row],[Menge\n    *)]]*3","v":0},{"$f":"Tabelle47[[#This Row],[Menge\n    *)]]*1.5","v":0},"X","X","X","X"]
[null,null,null,null,"656G6024",0,"GRAFENTHAL CPU XEON E5-2680 V4 14CORE","2,40GHz LGA2011 35MB CACHE 28 THREADS"," ",null,null,{"$f":"Tabelle47[[#This Row],[Menge\n    *)]]*-1","v":0},{"$f":"Tabelle47[[#This Row],[Menge\n    *)]]*10","v":0},"X","X","X","X","X","X","X","X","X","X","X",{"$f":"Tabelle47[[#This Row],[Menge\n    *)]]*3","v":0},{"$f":"Tabelle47[[#This Row],[Menge\n    *)]]*3","v":0},{"$f":"Tabelle47[[#This Row],[Menge\n    *)]]*3","v":0},{"$f":"Tabelle47[[#This Row],[Menge\n    *)]]*1.5","v":0},"X","X","X","X"]
[null,null,null,null,"656G6025",0,"GRAFENTHAL CPU XEON E5-2690 V4 14CORE","2,6Ghz LGA2011V3 35MB CACHE 28 THREADS"," ",null,null,{"$f":"Tabelle47[[#This Row],[Menge\n    *)]]*-1","v":0},{"$f":"Tabelle47[[#This Row],[Menge\n    *)]]*10","v":0},"X","X","X","X","X","X","X","X","X","X","X",{"$f":"Tabelle47[[#This Row],[Menge\n    *)]]*3","v":0},{"$f":"Tabelle47[[#This Row],[Menge\n    *)]]*3","v":0},{"$f":"Tabelle47[[#This Row],[Menge\n    *)]]*3","v":0},{"$f":"Tabelle47[[#This Row],[Menge\n    *)]]*1.5","v":0},"X","X","X","X"]
[null,null,null,null,"656G6026",0,"GRAFENTHAL CPU XEON E5-2687W V4 12CORE","3.00GHz LGA2011 30MB CACHE 24 THREADS"," ",null,null,{"$f":"Tabelle47[[#This Row],[Menge\n    *)]]*-1","v":0},{"$f":"Tabelle47[[#This Row],[Menge\n    *)]]*10","v":0},"X","X","X","X","X","X","X","X","X","X","X",{"$f":"Tabelle47[[#This Row],[Menge\n    *)]]*3","v":0},{"$f":"Tabelle47[[#This Row],[Menge\n    *)]]*3","v":0},{"$f":"Tabelle47[[#This Row],[Menge\n    *)]]*3","v":0},{"$f":"Tabelle47[[#This Row],[Menge\n    *)]]*1.5","v":0},"X","X","X","X"]
[null,null,null,null,"Heatsink",{"$f":"SUM(F30)","v":0}]
[null,null,null,null,"659G6016",{"$f":"IF(OR(SUM(F16:F16)>0,SUM(F18:F28)>0),SUM(F16:F16)+SUM(F18:F28)*1,0)","v":0},"GRAFENTHAL CPU COOLER FOR R2210 S2"," "," ",null,null,null,"X","X","X","X","X","X","X","X","X","X","X","X","X","X","X","X","X","X","X","X"]
[null,null,null,null,"Arbeitsspeicher",{"$f":"SUM(F32:F35)","v":0},"*Speicher dürfen nicht gemischt werden*"]
[null,null,null,null,"652G7000",0,"GRAFENTHAL MEM 16GB DDR4 2400MHz RDIMM","PC4-19200 CL17 DUAL RANKED ECC"," ",{"$f":"IF(COUNTIF($F$32:$F$35,\"<>0\")>1,-1,0)","v":0},null,null,{"$f":"Tabelle47[[#This Row],[Menge\n    *)]]*-1","v":0},"X","X","X","X","X","X","X","X","X","X","X","X","X","X","X","X","X","X","X"]
[null,null,null,null,"652G7001",0,"GRAFENTHAL MEM 16GB DDR4 2400MHz LRDIMM","PC4-19200L CL17 DUAL RANKED ECC"," ",null,null,null,{"$f":"Tabelle47[[#This Row],[Menge\n    *)]]*-1","v":0},"X","X","X","X","X","X","X","X","X","X","X","X","X","X","X","X","X","X","X"]
[null,null,null,null,"652G6011",0,"GRAFENTHAL MEM 32GB DDR4-2400MHz RDIMM","PC4-19200 CL17 DUAL RANKED ECC"," ",null,null,null,{"$f":"Tabelle47[[#This Row],[Menge\n    *)]]*-1","v":0},"X","X","X","X","X","X","X","X","X","X","X","X","X","X","X","X","X","X","X"]
[null,null,null,null,"652G7002",0,"GRAFENTHAL MEM 32GB DDR4 2400MHz LRDIMM","PC4-19200L CL17 DUAL RANKED ECC"," ",null,null,null,{"$f":"Tabelle47[[#This Row],[Menge\n    *)]]*-1","v":0}]
[null,null,null,null,"Festplatten",{"$f":"SUM(F56:F60)","v":0}]
[null,null,null,null,"SATA SSD 6GB/s *MIDRANGE*",{"$f":"SUM(F38:F39)","v":0}]
[null,null,null,null,"651G7011",0,"GRAFENTHAL SSD 240GB 2.5'' SATA 6GB/S","MIDRANGE 599 TBW"," ",null,null,null,"X",{"$f":"Tabelle47[[#This Row],[Menge\n    *)]]*-1","v":0},{"$f":"Tabelle47[[#This Row],[Menge\n    *)]]*-1","v":0},"X","X",{"$f":"Tabelle47[[#This Row],[Menge\n    *)]]*-1","v":0},"X","X","X","X","X","X","X","X","X","X","X","X",{"$f":"Tabelle47[[#This Row],[Menge\n    *)]]*-1","v":0},"X"]
[null,null,null,null,"651G7012",0,"GRAFENTHAL SSD 480GB 2.5'' SATA 6GB/S","MIDRANGE 945 TBW"," ",null,null,null,"X",{"$f":"Tabelle47[[#This Row],[Menge\n    *)]]*-1","v":0},{"$f":"Tabelle47[[#This Row],[Menge\n    *)]]*-1","v":0},"X","X",{"$f":"Tabelle47[[#This Row],[Menge\n    *)]]*-1","v":0},"X","X","X","X","X","X","X","X","X","X","X","X",{"$f":"Tabelle47[[#This Row],[Menge\n    *)]]*-1","v":0},"X"]
[null,null,null,null,"SATA SSD 6GB/s *ENTRY*",{"$f":"SUM(F41:F44)","v":0}]
[null,null,null,null,"651G8024",0,"GRAFENTHAL SSD 256GB SATA3 6GB/S 2.5''","MTBF 1.5M HOURS TBW 300TB"," ",null,null,null,"X",{"$f":"Tabelle47[[#This Row],[Menge\n    *)]]*-1","v":0},{"$f":"Tabelle47[[#This Row],[Menge\n    *)]]*-1","v":0},null,null,{"$f":"Tabelle47[[#This Row],[Menge\n    *)]]*-1","v":0},"X","X","X","X","X","X","X","X","X","X","X","X",{"$f":"Tabelle47[[#This Row],[Menge\n    *)]]*-1","v":0},"X"]
[null,null,null,null,"651G8025",0,"GRAFENTHAL SSD 512GB SATA3 6GB/S 2.5''","MTBF 1.5M HOURS TBW 300TB"," ",null,null,null,"X",{"$f":"Tabelle47[[#This Row],[Menge\n    *)]]*-1","v":0},{"$f":"Tabelle47[[#This Row],[Menge\n    *)]]*-1","v":0},null,null,{"$f":"Tabelle47[[#This Row],[Menge\n    *)]]*-1","v":0},"X","X","X","X","X","X","X","X","X","X","X","X",{"$f":"Tabelle47[[#This Row],[Menge\n    *)]]*-1","v":0},"X"]
[null,null,null,null,"651G8026",0,"GRAFENTHAL SSD 1TB SATA3 6GB/S 2.5''","MTBF 1.5M HOURS TBW 300TB"," ",null,null,null,"X",{"$f":"Tabelle47[[#This Row],[Menge\n    *)]]*-1","v":0},{"$f":"Tabelle47[[#This Row],[Menge\n    *)]]*-1","v":0},null,null,{"$f":"Tabelle47[[#This Row],[Menge\n    *)]]*-1","v":0},"X","X","X","X","X","X","X","X","X","X","X","X",{"$f":"Tabelle47[[#This Row],[Menge\n    *)]]*-1","v":0},"X"]
[null,null,null,null,"651G8027",0,"GRAFENTHAL SSD 2TB SATA3 6GB/S 2.5''","MTBF 1.5M HOURS TBW 300TB"," ",null,null,null,"X",{"$f":"Tabelle47[[#This Row],[Menge\n    *)]]*-1","v":0},{"$f":"Tabelle47[[#This Row],[Menge\n    *)]]*-1","v":0},null,null,{"$f":"Tabelle47[[#This Row],[Menge\n    *)]]*-1","v":0},"X","X","X","X","X","X","X","X","X","X","X","X",{"$f":"Tabelle47[[#This Row],[Menge\n    *)]]*-1","v":0},"X"]
[null,null,null,null,"SATA HDD 6GB/s",{"$f":"SUM(F46)","v":0}]
[null,null,null,null,"651G6002",0,"GRAFENTHAL HDD 1TB 2,5'' SATA 7200RPM","32MB CACHE 6GB/S BAUHÖHE 9.5MM","FUER SERVER UND WORKSTATION",null,null,null,"X","X",{"$f":"Tabelle47[[#This Row],[Menge\n    *)]]*-1","v":0},"X","X",{"$f":"Tabelle47[[#This Row],[Menge\n    *)]]*-1","v":0},"X","X","X","X","X","X","X","X","X","X","X","X",{"$f":"Tabelle47[[#This Row],[Menge\n    *)]]*-1","v":0},"X"]
[null,null,null,null,"SATA 3,5\" 7,2k 6GB/s",{"$f":"SUM(F48:F54)","v":0}]
[null,null,null,null,"651G8012",0,"GRAFENTHAL HDD 12TB SATA 3.5'' 7.2K","6GB/S MTBF 2.5M HOURS 5Y WARRANTY"," ",null,null,null,"X","X","X",{"$f":"Tabelle47[[#This Row],[Menge\n    *)]]*-1","v":0},"X",{"$f":"Tabelle47[[#This Row],[Menge\n    *)]]*-1","v":0},"X","X","X","X","X","X","X","X","X","X","X","X",{"$f":"Tabelle47[[#This Row],[Menge\n    *)]]*-1","v":0},"X"]
[null,null,null,null,"651G8013",0,"GRAFENTHAL HDD 10TB SATA 3.5''","7.2K 6GB/S MTBF 2.5M HOURS 5Y WARRANTY"," ",null,null,null,"X","X","X",{"$f":"Tabelle47[[#This Row],[Menge\n    *)]]*-1","v":0},"X",{"$f":"Tabelle47[[#This Row],[Menge\n    *)]]*-1","v":0},"X","X","X","X","X","X","X","X","X","X","X","X",{"$f":"Tabelle47[[#This Row],[Menge\n    *)]]*-1","v":0},"X"]
[null,null,null,null,"651G8014",0,"GRAFENTHAL HDD 8TB SATA 3.5''","7.2K 6GB/S MTBF 2.5M HOURS 5Y WARRANTY"," ",null,null,null,"X","X","X",{"$f":"Tabelle47[[#This Row],[Menge\n    *)]]*-1","v":0},"X",{"$f":"Tabelle47[[#This Row],[Menge\n    *)]]*-1","v":0},"X","X","X","X","X","X","X","X","X","X","X","X",{"$f":"Tabelle47[[#This Row],[Menge\n    *)]]*-1","v":0},"X"]
[null,null,null,null,"651G8015",0,"GRAFENTHAL HDD 6TB SATA 3.5''","7.2K 6GB/S MTBF 2.5M HOURS 5Y WARRANTY"," ",null,null,null,"X","X","X",{"$f":"Tabelle47[[#This Row],[Menge\n    *)]]*-1","v":0},"X",{"$f":"Tabelle47[[#This Row],[Menge\n    *)]]*-1","v":0},"X","X","X","X","X","X","X","X","X","X","X","X",{"$f":"Tabelle47[[#This Row],[Menge\n    *)]]*-1","v":0},"X"]
[null,null,null,null,"651G8016",0,"GRAFENTHAL HDD 4TB SATA 3.5''","7.2K 6GB/S MTBF 2.5M HOURS 5Y WARRANTY"," ",null,null,null,"X","X","X",{"$f":"Tabelle47[[#This Row],[Menge\n    *)]]*-1","v":0},"X",{"$f":"Tabelle47[[#This Row],[Menge\n    *)]]*-1","v":0},"X","X","X","X","X","X","X","X","X","X","X","X",{"$f":"Tabelle47[[#This Row],[Menge\n    *)]]*-1","v":0},"X"]
[null,null,null,null,"651G8017",0,"GRAFENTHAL HDD 2TB SATA 3.5''","7.2K 6GB/S MTBF 2.5M HOURS 5Y WARRANTY"," ",null,null,null,"X","X","X",{"$f":"Tabelle47[[#This Row],[Menge\n    *)]]*-1","v":0},"X",{"$f":"Tabelle47[[#This Row],[Menge\n    *)]]*-1","v":0},"X","X","X","X","X","X","X","X","X","X","X","X",{"$f":"Tabelle47[[#This Row],[Menge\n    *)]]*-1","v":0},"X"]
[null,null,null,null,"651G8018",0,"GRAFENTHAL HDD 1TB SATA 3.5''","7.2K 6GB/S MTBF 2.5M HOURS 5Y WARRANTY"," ",null,null,null,"X","X","X",{"$f":"Tabelle47[[#This Row],[Menge\n    *)]]*-1","v":0},"X",{"$f":"Tabelle47[[#This Row],[Menge\n    *)]]*-1","v":0},"X","X","X","X","X","X","X","X","X","X","X","X",{"$f":"Tabelle47[[#This Row],[Menge\n    *)]]*-1","v":0},"X"]
[null,null,null,null,"SAS 2,5\" 10k 12GB/s",{"$f":"SUM(F56:F60)","v":0}]
[null,null,null,null,"651G8020",0,"GRAFENTHAL HDD 300GB 10K 2.5'' SAS","12GB/S"," ",null,null,null,"X","X",{"$f":"Tabelle47[[#This Row],[Menge\n    *)]]*-1","v":0},"X",{"$f":"Tabelle47[[#This Row],[Menge\n    *)]]*-1","v":0},"X","X","X","X","X","X","X","X","X","X","X","X","X",{"$f":"Tabelle47[[#This Row],[Menge\n    *)]]*-1","v":0},"X"]
[null,null,null,null,"651G8005",0,"GRAFENTHAL HDD 600GB 10K 2.5\\ SAS 12GB/S\""," "," ",null,null,null,"X","X",{"$f":"Tabelle47[[#This Row],[Menge\n    *)]]*-1","v":0},"X",{"$f":"Tabelle47[[#This Row],[Menge\n    *)]]*-1","v":0},"X","X","X","X","X","X","X","X","X","X","X","X","X",{"$f":"Tabelle47[[#This Row],[Menge\n    *)]]*-1","v":0},"X"]
[null,null,null,null,"651G8006",0,"GRAFENTHAL HDD 900GB 10K 2.5\\ SAS 12GB/S\""," "," ",null,null,null,"X","X",{"$f":"Tabelle47[[#This Row],[Menge\n    *)]]*-1","v":0},"X",{"$f":"Tabelle47[[#This Row],[Menge\n    *)]]*-1","v":0},"X","X","X","X","X","X","X","X","X","X","X","X","X",{"$f":"Tabelle47[[#This Row],[Menge\n    *)]]*-1","v":0},"X"]
[null,null,null,null,"651G8007",0,"GRAFENTHAL HDD 1.2TB 10K 2.5\\ SAS 12GB/S\""," "," ",null,null,null,"X","X",{"$f":"Tabelle47[[#This Row],[Menge\n    *)]]*-1","v":0},"X",{"$f":"Tabelle47[[#This Row],[Menge\n    *)]]*-1","v":0},"X","X","X","X","X","X","X","X","X","X","X","X","X",{"$f":"Tabelle47[[#This Row],[Menge\n    *)]]*-1","v":0},"X"]
[null,null,null,null,"651G8021",0,"GRAFENTHAL HDD 1.8TB 10K 2.5'' SAS","12GB/S"," ",null,null,null,"X","X",{"$f":"Tabelle47[[#This Row],[Menge\n    *)]]*-1","v":0},"X",{"$f":"Tabelle47[[#This Row],[Menge\n    *)]]*-1","v":0},"X","X","X","X","X","X","X","X","X","X","X","X","X",{"$f":"Tabelle47[[#This Row],[Menge\n    *)]]*-1","v":0},"X"]
[null,null,null,null,"651G8022",0,"GRAFENTHAL HDD 2.4TB 10K 2.5'' SAS","12GB/S"," ",null,null,null,"X","X",{"$f":"Tabelle47[[#This Row],[Menge\n    *)]]*-1","v":0},"X",{"$f":"Tabelle47[[#This Row],[Menge\n    *)]]*-1","v":0},"X","X","X","X","X","X","X","X","X","X","X","X","X",{"$f":"Tabelle47[[#This Row],[Menge\n    *)]]*-1","v":0},"X"]
[null,null,null,null,"SAS 2,5\" 15k 12GB/s",{"$f":"SUM(F63:F65)","v":0}]
[null,null,null,null,"651G8003",0,"GRAFENTHAL HDD 300GB 15K 2.5\\ SAS 12GB/S\""," "," ",null,null,null,"X","X",{"$f":"Tabelle47[[#This Row],[Menge\n    *)]]*-1","v":0},"X",{"$f":"Tabelle47[[#This Row],[Menge\n    *)]]*-1","v":0},"X","X","X","X","X","X","X","X","X","X","X","X","X",{"$f":"Tabelle47[[#This Row],[Menge\n    *)]]*-1","v":0},"X"]
[null,null,null,null,"651G8004",0,"GRAFENTHAL HDD 600GB 15K 2.5\\ SAS 12GB/S\""," "," ",null,null,null,"X","X",{"$f":"Tabelle47[[#This Row],[Menge\n    *)]]*-1","v":0},"X",{"$f":"Tabelle47[[#This Row],[Menge\n    *)]]*-1","v":0},"X","X","X","X","X","X","X","X","X","X","X","X","X",{"$f":"Tabelle47[[#This Row],[Menge\n    *)]]*-1","v":0},"X"]
[null,null,null,null,"651G8019",0,"GRAFENTHAL HDD 900GB 15K 2.5'' SAS","12GB/S"," ",null,null,null,"X","X",{"$f":"Tabelle47[[#This Row],[Menge\n    *)]]*-1","v":0},"X",{"$f":"Tabelle47[[#This Row],[Menge\n    *)]]*-1","v":0},"X","X","X","X","X","X","X","X","X","X","X","X","X",{"$f":"Tabelle47[[#This Row],[Menge\n    *)]]*-1","v":0},"X"]
[null,null,null,null,"SAS SSD  12GB/s *ENTERPRISE*",{"$f":"SUM(F67:F70)","v":0}]
[null,null,null,null,"651G7004",0,"GRAFENTHAL SSD 480GB 2,5'' SAS 12GB/S","MIDRANGE DWPD 1"," ",null,null,null,"X",{"$f":"Tabelle47[[#This Row],[Menge\n    *)]]*-1","v":0},{"$f":"Tabelle47[[#This Row],[Menge\n    *)]]*-1","v":0},"X",{"$f":"Tabelle47[[#This Row],[Menge\n    *)]]*-1","v":0},"X","X","X","X","X","X","X","X","X","X","X","X","X",{"$f":"Tabelle47[[#This Row],[Menge\n    *)]]*-1","v":0},"X"]
[null,null,null,null,"651G7005",0,"GRAFENTHAL SSD 960GB 2,5'' SAS 12GB/S","MIDRANGE DWPD 1"," ",null,null,null,null,{"$f":"Tabelle47[[#This Row],[Menge\n    *)]]*-1","v":0},{"$f":"Tabelle47[[#This Row],[Menge\n    *)]]*-1","v":0},null,{"$f":"Tabelle47[[#This Row],[Menge\n    *)]]*-1","v":0},null,null,null,null,null,null,null,null,null,null,null,null,null,{"$f":"Tabelle47[[#This Row],[Menge\n    *)]]*-1","v":0}]
[null,null,null,null,"651G7006",0,"GRAFENTHAL SSD 1920GB 2,5'' SAS 12GB/S","MIDRANGE DWPD 1"," ",null,null,null,"X",{"$f":"Tabelle47[[#This Row],[Menge\n    *)]]*-1","v":0},{"$f":"Tabelle47[[#This Row],[Menge\n    *)]]*-1","v":0},"X",{"$f":"Tabelle47[[#This Row],[Menge\n    *)]]*-1","v":0},"X","X","X","X","X","X","X","X","X","X","X","X","X",{"$f":"Tabelle47[[#This Row],[Menge\n    *)]]*-1","v":0},"X"]
[null,null,null,null,"651G7007",0,"GRAFENTHAL SSD 3840GB 2,5'' SAS 12GB/S","MIDRANGE DWPD 1"," ",null,null,null,null,{"$f":"Tabelle47[[#This Row],[Menge\n    *)]]*-1","v":0},{"$f":"Tabelle47[[#This Row],[Menge\n    *)]]*-1","v":0},null,{"$f":"Tabelle47[[#This Row],[Menge\n    *)]]*-1","v":0},null,null,null,null,null,null,null,null,null,null,null,null,null,{"$f":"Tabelle47[[#This Row],[Menge\n    *)]]*-1","v":0}]
[null,null,null,null,"SAS 3,5\" 7,2k  12GB/s",{"$f":"SUM(F72:F76)","v":0}]
[null,null,null,null,"651G6021",0,"HDD 2TB SAS 7,2K 3,5“ 12GB/S 24/7","FOR GRAFENTHAL SERVER","MTTF 2.5M HOURS",null,null,null,"X","X","X",{"$f":"Tabelle47[[#This Row],[Menge\n    *)]]*-1","v":0},{"$f":"Tabelle47[[#This Row],[Menge\n    *)]]*-1","v":0},"X","X","X","X","X","X","X","X","X","X","X","X","X",{"$f":"Tabelle47[[#This Row],[Menge\n    *)]]*-1","v":0},"X"]
[null,null,null,null,"651G6020",0,"GRAFENTHAL HDD 4TB SAS 7,2K 3,5“ 12GB/S","24/7","MTTF 2.5M HOURS",null,null,null,"X","X","X",{"$f":"Tabelle47[[#This Row],[Menge\n    *)]]*-1","v":0},{"$f":"Tabelle47[[#This Row],[Menge\n    *)]]*-1","v":0},"X","X","X","X","X","X","X","X","X","X","X","X","X",{"$f":"Tabelle47[[#This Row],[Menge\n    *)]]*-1","v":0},"X"]
[null,null,null,null,"651G6019",0,"HDD 6TB SAS 7,2K 3,5“ 12GB/S 24/7","FOR GRAFENTHAL SERVER","MTTF 2.5M HOURS",null,null,null,"X","X","X",{"$f":"Tabelle47[[#This Row],[Menge\n    *)]]*-1","v":0},{"$f":"Tabelle47[[#This Row],[Menge\n    *)]]*-1","v":0},"X","X","X","X","X","X","X","X","X","X","X","X","X",{"$f":"Tabelle47[[#This Row],[Menge\n    *)]]*-1","v":0},"X"]
[null,null,null,null,"651G6018",0,"HDD 8TB SAS 7,2K 3,5“ 12GB/S 24/7","FOR GRAFENTHAL SERVER","MTTF 2.5M HOURS",null,null,null,"X","X","X",{"$f":"Tabelle47[[#This Row],[Menge\n    *)]]*-1","v":0},{"$f":"Tabelle47[[#This Row],[Menge\n    *)]]*-1","v":0},"X","X","X","X","X","X","X","X","X","X","X","X","X",{"$f":"Tabelle47[[#This Row],[Menge\n    *)]]*-1","v":0},"X"]
[null,null,null,null,"651G6016",0,"HDD 10TB SAS 7,2K 3,5“ 12GB/S 24/7","FOR GRAFENTHAL SERVER","MTTF 2.5M HOURS",null,null,null,"X","X","X",{"$f":"Tabelle47[[#This Row],[Menge\n    *)]]*-1","v":0},{"$f":"Tabelle47[[#This Row],[Menge\n    *)]]*-1","v":0},"X","X","X","X","X","X","X","X","X","X","X","X","X",{"$f":"Tabelle47[[#This Row],[Menge\n    *)]]*-1","v":0},"X"]
[null,null,null,null,"SSD PCIe NVMe",{"$f":"SUM(F78:F80)","v":0}]
[null,null,null,null,"651G6030",0,"GRAFENTHAL SSD 800GB NVME ENTERPRISE","READ 3100MB/S WRITE 2350MB/S 32GT/S","PCI EXPRESS 3.0",null,null,null,"X","X","X","X","X","X","X","X","X","X","X","X",{"$f":"Tabelle47[[#This Row],[Menge\n    *)]]*-1","v":0},{"$f":"Tabelle47[[#This Row],[Menge\n    *)]]*-1","v":0},"X","X","X","X",{"$f":"Tabelle47[[#This Row],[Menge\n    *)]]*-1","v":0},"X"]
[null,null,null,null,"651G6031",0,"GRAFENTHAL SSD 1600GB NVME ENTERPRISE","READ 3100MB/S WRITE 2350MB/S 32GT/S","PCI EXPRESS 3.0",null,null,null,"X","X","X","X","X","X","X","X","X","X","X","X",{"$f":"Tabelle47[[#This Row],[Menge\n    *)]]*-1","v":0},{"$f":"Tabelle47[[#This Row],[Menge\n    *)]]*-1","v":0},"X","X","X","X",{"$f":"Tabelle47[[#This Row],[Menge\n    *)]]*-1","v":0},"X"]
[null,null,null,null,"651G6032",0,"GRAFENTHAL SSD 3200GB NVME ENTERPRISE","READ 3100MB/S WRITE 2350MB/S 32GT/S","PCI EXPRESS 3.0",null,null,null,"X","X","X","X","X","X","X","X","X","X","X","X",{"$f":"Tabelle47[[#This Row],[Menge\n    *)]]*-1","v":0},{"$f":"Tabelle47[[#This Row],[Menge\n    *)]]*-1","v":0},"X","X","X","X",{"$f":"Tabelle47[[#This Row],[Menge\n    *)]]*-1","v":0},"X"]
[null,null,null,null,"DVD",{"$f":"SUM(F82)","v":0}]
[null,null,null,null,"658G5001",0,"GRAFENTHAL DVD-DRIVE FOR R2208 S2"," "," ",null,null,null,"X","X","X","X","X","X","X","X","X","X","X","X","X","X","X","X",{"$f":"Tabelle47[[#This Row],[Menge\n    *)]]*-1","v":0},"X","X","X"]
[null,null,null,null,"Raid Controller",{"$f":"SUM(F84:F88)","v":0}]
[null,null,null,null,"653G5008",0,"GRAFENTHAL RAID CONTROLLER SAS/SATA","12GB/S /6GB/S 8i NO CACHE"," ",null,null,null,"X",{"$f":"Tabelle47[[#This Row],[Menge\n    *)]]*8","v":0},{"$f":"Tabelle47[[#This Row],[Menge\n    *)]]*8","v":0},{"$f":"Tabelle47[[#This Row],[Menge\n    *)]]*8","v":0},{"$f":"Tabelle47[[#This Row],[Menge\n    *)]]*8","v":0},{"$f":"Tabelle47[[#This Row],[Menge\n    *)]]*8","v":0},"X","X","X",{"$f":"Tabelle47[[#This Row],[Menge\n    *)]]*1","v":0},"X","X",{"$f":"Tabelle47[[#This Row],[Menge\n    *)]]*-1","v":0},{"$f":"Tabelle47[[#This Row],[Menge\n    *)]]*-1","v":0},{"$f":"Tabelle47[[#This Row],[Menge\n    *)]]*-1","v":0},"X","X","X","X","X"]
[null,null,null,null,"653G5007",0,"GRAFENTHAL RAID CONTROLLER SAS/SATA","12GB/S /6GB/S 8i 1GB CACHE","RAID 0 1  5 6 10 50 60 TYP 9361-8I",null,null,null,"X",{"$f":"Tabelle47[[#This Row],[Menge\n    *)]]*8","v":0},{"$f":"Tabelle47[[#This Row],[Menge\n    *)]]*8","v":0},{"$f":"Tabelle47[[#This Row],[Menge\n    *)]]*8","v":0},{"$f":"Tabelle47[[#This Row],[Menge\n    *)]]*8","v":0},{"$f":"Tabelle47[[#This Row],[Menge\n    *)]]*8","v":0},"X","X","X","X","X","X",{"$f":"Tabelle47[[#This Row],[Menge\n    *)]]*-1","v":0},{"$f":"Tabelle47[[#This Row],[Menge\n    *)]]*-1","v":0},{"$f":"Tabelle47[[#This Row],[Menge\n    *)]]*-1","v":0},"X","X","X","X","X"]
[null,null,null,null,"653G7001",0,"GRAFENTHAL MEGARAID CACHECADE PRO 2.0","PHYSICAL KEY SSD CACHE ENABLER"," ",null,null,null,"X","X","X","X","X","X","X","X","X",{"$f":"Tabelle47[[#This Row],[Menge\n    *)]]*-1","v":0},"X","X","X","X","X","X","X","X","X","X"]
[null,null,null,null,"658G7000",{"$f":"SUM(F84:F85)*2","v":0},"GRAFENTHAL CABLE INTERNAL 4x MINI SAS HD","TO 4x MINI SAS HD SFF-8643 0.8M"," "]
[null,null,null,null,"653G3003",0,"GRAFENTHAL RAID CABLE MINI-SAS","(SFF-8087) TO 4x SATA 0.6M"," "]
[null,null,null,null,"HBA SAS",{"$f":"SUM(F90:F93)","v":0}]
[null,null,null,null,"659G4013",0,"GRAFENTHAL EXTERNAL SAS CABLE 1M","MINI MULTILANE SFF-8088 TO SFF-8644"," ",null,null,null,"X","X","X","X","X","X","X","X","X","X","X","X","X","X","X","X","X","X","X","X"]
[null,null,null,null,"653G7005",0,"GRAFENTHAL CONTROLLER HBA SAS 9300-8E","8 PORT EXTERN MULTI LANE PCI LP BROADCOM"," ",null,null,null,null,null,null,null,null,null,null,null,null,null,null,null,{"$f":"Tabelle47[[#This Row],[Menge\n    *)]]*-1","v":0},{"$f":"Tabelle47[[#This Row],[Menge\n    *)]]*-1","v":0},{"$f":"Tabelle47[[#This Row],[Menge\n    *)]]*-1","v":0}]
[null,null,null,null,"653G7006",0,"GRAFENTHAL EXTERNAL SAS CABLE 2M","SFF-8644 TO SFF-8644"," "]
[null,null,null,null,"653G7007",0,"GRAFENTHAL EXTERNAL SAS CABLE 1M","SFF-8644 TO SFF-8644"," "]
[null,null,null,null,"(Kupfer-) Netzkarte",{"$f":"SUM(F95:F96)","v":0}]
[null,null,null,null,"653G7002",0,"GRAFENTHAL ETHERNET ADAPTER DUAL PORT","RJ45 2x10GBE X550-T2 PCIe 3.0 x4"," ",null,null,null,"X","X","X","X","X","X","X","X","X","X","X","X",{"$f":"Tabelle47[[#This Row],[Menge\n    *)]]*-1","v":0},{"$f":"Tabelle47[[#This Row],[Menge\n    *)]]*-1","v":0},{"$f":"Tabelle47[[#This Row],[Menge\n    *)]]*-1","v":0},"X","X","X","X","X"]
[null,null,null,null,"659G8015",0,"GRAFENTHAL GIGABIT ETHERNET APDATER","I350-T4V2 4x RJ-45 PCIe x4 COPPER"," ",null,null,null,"X","X","X","X","X","X","X","X","X","X","X","X",{"$f":"Tabelle47[[#This Row],[Menge\n    *)]]*-1","v":0},{"$f":"Tabelle47[[#This Row],[Menge\n    *)]]*-1","v":0},"X","X","X","X","X","X"]
[null,null,null,null,"(SFP+)Netzwerkkarte",{"$f":"SUM(F98:F99)","v":0}]
[null,null,null,null,"653G7000",0,"GRAFENTHAL ETHERNET ADAPTER DUAL PORT","QSFP+ 2x10GBE/40GBE PCIe 3.0 x8 XL710-QD"," ",null,null,null,null,null,null,null,null,null,null,null,null,null,null,null,{"$f":"Tabelle47[[#This Row],[Menge\n    *)]]*-1","v":0},{"$f":"Tabelle47[[#This Row],[Menge\n    *)]]*-1","v":0},{"$f":"Tabelle47[[#This Row],[Menge\n    *)]]*-1","v":0}]
[null,null,null,null,"653G7003",0,"GRAFENTHAL ETHERNET ADAPTER 2-PORT 10GBE","INTEL X520 FIBRE SFP+ PCIe x8 LP"," ",null,null,null,null,null,null,null,null,null,null,null,null,null,null,null,{"$f":"Tabelle47[[#This Row],[Menge\n    *)]]*-1","v":0},{"$f":"Tabelle47[[#This Row],[Menge\n    *)]]*-1","v":0},{"$f":"Tabelle47[[#This Row],[Menge\n    *)]]*-1","v":0}]
[null,null,null,null,"Glasfaserkarten",{"$f":"SUM(F101:F102)","v":0}]
[null,null,null,null,"659G7000",0,"GRAFENTHAL QLOGIC HBA FC SINGLE PORT","16GB/S PCIe 3.0 x8"," ",null,null,null,"X","X","X","X","X","X","X","X","X","X","X","X",{"$f":"Tabelle47[[#This Row],[Menge\n    *)]]*-1","v":0},{"$f":"Tabelle47[[#This Row],[Menge\n    *)]]*-1","v":0},{"$f":"Tabelle47[[#This Row],[Menge\n    *)]]*-1","v":0},"X","X","X","X","X"]
[null,null,null,null,"659G7001",0,"GRAFENTHAL QLOGIC HBA FC DUAL PORT","16GB/S PCIe 3.0 x8"," ",null,null,null,"X","X","X","X","X","X","X","X","X","X","X","X",{"$f":"Tabelle47[[#This Row],[Menge\n    *)]]*-1","v":0},{"$f":"Tabelle47[[#This Row],[Menge\n    *)]]*-1","v":0},{"$f":"Tabelle47[[#This Row],[Menge\n    *)]]*-1","v":0},"X","X","X","X","X"]
[null,null,null,null,"Grafikkarte",{"$f":"SUM(#REF!)","v":{"$error":"#REF!"}}]
[null,null,null,null,"Betriebssysteme",{"$f":"SUM(F105:F107)","v":0}]
[null,null,null,null,"655G3002",0,"GRAFENTHAL WINDOWS SERVER 2012 R2","ESSENTIALS LIZENZ UND MEDIEN 1-2 CPU"," ",null,null,null,"X","X","X","X","X","X","X","X","X","X","X","X","X","X","X","X","X","X","X","X"]
[null,null,null,null,"655G3003",0,"GRAFENTHAL WINDOWS SERVER 2012 R2","STANDARD LIZENZ UND MEDIEN 2 CPU"," ",null,null,null,"X","X","X","X","X","X","X","X","X","X","X","X","X","X","X","X","X","X","X","X"]
[null,null,null,null,"P73-07115",0,"MICROSOFT WINDOWS SERVER 2016 STANDARD","64BIT 16C"," "]
[null,null,null,null,"Open-E",{"$f":"SUM(F109:F120)","v":0}]
[null,null,null,null,1701,0,"OPEN-E DSS V7 STORAGE SOFTWARE OS, 4TB"," ",null,null,null,null,"X","X","X","X","X","X","X","X","X","X","X",{"$f":"Tabelle47[[#This Row],[Menge\n    *)]]*-1","v":0},"X","X","X","X","X","X","X","X"]
[null,null,null,null,1702,0,"OPEN-E DSS V7 STORAGE SOFTWARE OS, 8TB"," ",null,null,null,null,"X","X","X","X","X","X","X","X","X","X","X",{"$f":"Tabelle47[[#This Row],[Menge\n    *)]]*-1","v":0},"X","X","X","X","X","X","X","X"]
[null,null,null,null,1703,0,"OPEN-E DSS V7 STORAGE SOFTWARE OS, 16TB"," ",null,null,null,null,"X","X","X","X","X","X","X","X","X","X","X",{"$f":"Tabelle47[[#This Row],[Menge\n    *)]]*-1","v":0},"X","X","X","X","X","X","X","X"]
[null,null,null,null,1704,0,"OPEN-E DSS V7 STORAGE SOFTWARE OS,","UNLIMITED TB",null,null,null,null,"X","X","X","X","X","X","X","X","X","X","X",{"$f":"Tabelle47[[#This Row],[Menge\n    *)]]*-1","v":0},"X","X","X","X","X","X","X","X"]
[null,null,null,null,1719,0,"OPEN-E FEATURE PACK-ACTIVE iSCSI,","FAILOVER V7 ONLY TWO LICENSE KEY",null,null,null,null,"X","X","X","X","X","X","X","X","X","X","X",{"$f":"Tabelle47[[#This Row],[Menge\n    *)]]*-1","v":0},"X","X","X","X","X","X","X","X"]
[null,null,null,null,1775,0,"OPEN-E STANDARD SUPPORT, 1 YEAR,","8 BUSINESS HR PHONE OR EMAIL",null,null,null,null,"X","X","X","X","X","X","X","X","X","X","X",{"$f":"Tabelle47[[#This Row],[Menge\n    *)]]*-1","v":0},"X","X","X","X","X","X","X","X"]
[null,null,null,null,1776,0,"OPEN-E PREMIUM SUPPORT, 1 YEAR","4 BUSINESS HR PHONE EMAIL REMOTE CONSOLE",null,null,null,null,"X","X","X","X","X","X","X","X","X","X","X",{"$f":"Tabelle47[[#This Row],[Menge\n    *)]]*-1","v":0},"X","X","X","X","X","X","X","X"]
[null,null,null,null,1777,0,"OPEN-E 24/7 SUPPORT,3 YEARS,4 BUSI. HR.","UP TO 4H AFTER SUBMISSION OF TICKET",null,null,null,null,"X","X","X","X","X","X","X","X","X","X","X",{"$f":"Tabelle47[[#This Row],[Menge\n    *)]]*-1","v":0},"X","X","X","X","X","X","X","X"]
[null,null,null,null,1778,0,"OPEN-E UPGRADE TO 3 YEARS BASIC SUPPORT"," ",null,null,null,null,"X","X","X","X","X","X","X","X","X","X","X",{"$f":"Tabelle47[[#This Row],[Menge\n    *)]]*-1","v":0},"X","X","X","X","X","X","X","X"]
[null,null,null,null,1779,0,"OPEN-E UPGRADE TO 3 YEARS STANDARD","SUPPORT",null,null,null,null,"X","X","X","X","X","X","X","X","X","X","X",{"$f":"Tabelle47[[#This Row],[Menge\n    *)]]*-1","v":0},"X","X","X","X","X","X","X","X"]
[null,null,null,null,1780,0,"OPEN-E UPGRADE TO 3 YEARS PREMIUM","SUPPORT",null,null,null,null,"X","X","X","X","X","X","X","X","X","X","X",{"$f":"Tabelle47[[#This Row],[Menge\n    *)]]*-1","v":0},"X","X","X","X","X","X","X","X"]
[null,null,null,null,1781,0,"OPEN-E 24/7 SUPPORT,3 YEARS,4 BUSI. HR.","UP TO 4H AFTER SUBMISSION OF TICKET",null,null,null,null,"X","X","X","X","X","X","X","X","X","X","X",{"$f":"Tabelle47[[#This Row],[Menge\n    *)]]*-1","v":0},"X","X","X","X","X","X","X","X"]
[null,null,null,null,"MPAC",{"$f":"SUM(F122:F157)","v":0}]
[null,null,null,null,"740M6103",0,"GRAFENTHAL MPAC VOR ORT SERVICE UPGRADE","3 JAHRE 13x5 24 STD WIEDERHERSTELLUNG","FÜR R2210 S2 AB E5-2650",null,null,null,"X","X","X","X","X","X","X","X","X","X","X","X","X","X","X","X","X","X","X","X"]
[null,null,null,null,"740M6104",0,"GRAFENTHAL MPAC VOR ORT SERVICE UPGRADE","3 JAHRE 13x5 12 STD WIEDERHERSTELLUNG","FÜR R2210 S2 AB E5-2650",null,null,null,"X","X","X","X","X","X","X","X","X","X","X","X","X","X","X","X","X","X","X","X"]
[null,null,null,null,"740M6105",0,"GRAFENTHAL MPAC VOR ORT SERVICE UPGRADE","3 JAHRE 24x7 6 STD WIEDERHERSTELLUNG","FÜR R2210 S2 AB E5-2650",null,null,null,"X","X","X","X","X","X","X","X","X","X","X","X","X","X","X","X","X","X","X","X"]
[null,null,null,null,"740M6106",0,"GRAFENTHAL MPAC VOR ORT SERVICE UPGRADE","4 JAHRE 13x5 24 STD WIEDERHERSTELLUNG","FÜR R2210 S2 AB E5-2650",null,null,null,"X","X","X","X","X","X","X","X","X","X","X","X","X","X","X","X","X","X","X","X"]
[null,null,null,null,"740M6107",0,"GRAFENTHAL MPAC VOR ORT SERVICE UPGRADE","4 JAHRE 13x5 12 STD WIEDERHERSTELLUNG","FÜR R2210 S2 AB E5-2650",null,null,null,"X","X","X","X","X","X","X","X","X","X","X","X","X","X","X","X","X","X","X","X"]
[null,null,null,null,"740M6108",0,"GRAFENTHAL MPAC VOR ORT SERVICE UPGRADE","4 JAHRE 24x7 6 STD WIEDERHERSTELLUNG","FÜR R2210 S2 AB E5-2650",null,null,null,"X","X","X","X","X","X","X","X","X","X","X","X","X","X","X","X","X","X","X","X"]
[null,null,null,null,"740M6109",0,"GRAFENTHAL MPAC VOR ORT SERVICE UPGRADE","5 JAHRE 13x5 24 STD WIEDERHERSTELLUNG","FÜR R2210 S2 AB E5-2650",null,null,null,"X","X","X","X","X","X","X","X","X","X","X","X","X","X","X","X","X","X","X","X"]
[null,null,null,null,"740M6110",0,"GRAFENTHAL MPAC VOR ORT SERVICE UPGRADE","5 JAHRE 13x5 12 STD WIEDERHERSTELLUNG","FÜR R2210 S2 AB E5-2650",null,null,null,"X","X","X","X","X","X","X","X","X","X","X","X","X","X","X","X","X","X","X","X"]
[null,null,null,null,"740M6111",0,"GRAFENTHAL MPAC VOR ORT SERVICE UPGRADE","5 JAHRE 24x7 6 STD WIEDERHERSTELLUNG","FÜR R2210 S2 AB E5-2650",null,null,null,"X","X","X","X","X","X","X","X","X","X","X","X","X","X","X","X","X","X","X","X"]
[null,null,null,null,"740M6112",0,"GRAFENTHAL MPAC VOR ORT SERVICE UPGRADE","3 JAHRE 13x5 24STD WIEDERHERSTELLUNG DMR","FÜR R2210 S2 AB E5-2650",null,null,null,"X","X","X","X","X","X","X","X","X","X","X","X","X","X","X","X","X","X","X","X"]
[null,null,null,null,"740M6113",0,"GRAFENTHAL MPAC VOR ORT SERVICE UPGRADE","3 JAHRE 13x5 12STD WIEDERHERSTELLUNG DMR","FÜR R2210 S2 AB E5-2650",null,null,null,"X","X","X","X","X","X","X","X","X","X","X","X","X","X","X","X","X","X","X","X"]
[null,null,null,null,"740M6114",0,"GRAFENTHAL MPAC VOR ORT SERVICE UPGRADE","3 JAHRE 24x7 6 STD WIEDERHERSTELLUNG","FÜR R2210 S2 AB E5-2650",null,null,null,"X","X","X","X","X","X","X","X","X","X","X","X","X","X","X","X","X","X","X","X"]
[null,null,null,null,"740M6115",0,"GRAFENTHAL MPAC VOR ORT SERVICE UPGRADE","4 JAHRE 13x5 24STD WIEDERHERSTELLUNG DMR","FÜR R2210 S2 AB E5-2650",null,null,null,"X","X","X","X","X","X","X","X","X","X","X","X","X","X","X","X","X","X","X","X"]
[null,null,null,null,"740M6116",0,"GRAFENTHAL MPAC VOR ORT SERVICE UPGRADE","4 JAHRE 13x5 12STD WIEDERHERSTELLUNG DMR","FÜR R2210 S2 AB E5-2650",null,null,null,"X","X","X","X","X","X","X","X","X","X","X","X","X","X","X","X","X","X","X","X"]
[null,null,null,null,"740M6117",0,"GRAFENTHAL MPAC VOR ORT SERVICE UPGRADE","4 JAHRE 24x7 6 STD WIEDERHERSTELLUNG DMR","FÜR R2210 S2 AB E5-2650",null,null,null,"X","X","X","X","X","X","X","X","X","X","X","X","X","X","X","X","X","X","X","X"]
[null,null,null,null,"740M6118",0,"GRAFENTHAL MPAC VOR ORT SERVICE UPGRADE","5 JAHRE 13x5 24 STDWIEDERHERSTELLUNG DMR","FÜR R2210 S2 AB E5-2650",null,null,null,"X","X","X","X","X","X","X","X","X","X","X","X","X","X","X","X","X","X","X","X"]
[null,null,null,null,"740M6119",0,"GRAFENTHAL MPAC VOR ORT SERVICE UPGRADE","5 JAHRE 13x5 12STD WIEDERHERSTELLUNG DMR","FÜR R2210 S2 AB E5-2650",null,null,null,"X","X","X","X","X","X","X","X","X","X","X","X","X","X","X","X","X","X","X","X"]
[null,null,null,null,"740M6120",0,"GRAFENTHAL MPAC VOR ORT SERVICE UPGRADE","5 JAHRE 24x7 6 STD WIEDERHERSTELLUNG DMR","FÜR R2210 S2 AB E5-2650",null,null,null,"X","X","X","X","X","X","X","X","X","X","X","X","X","X","X","X","X","X","X","X"]
[null,null,null,null,"740M6121",0,"GRAFENTHAL MPAC VOR ORT SERVICE UPGRADE","3 JAHRE 13x5 24 STD WIEDERHERSTELLUNG","FÜR R2210 S2 BIS E5-264X",null,null,null,"X","X","X","X","X","X","X","X","X","X","X","X","X","X","X","X","X","X","X","X"]
[null,null,null,null,"740M6122",0,"GRAFENTHAL MPAC VOR ORT SERVICE UPGRADE","3 JAHRE 13x5 12 STD WIEDERHERSTELLUNG","FÜR R2210 S2 BIS E5-264X",null,null,null,"X","X","X","X","X","X","X","X","X","X","X","X","X","X","X","X","X","X","X","X"]
[null,null,null,null,"740M6123",0,"GRAFENTHAL MPAC VOR ORT SERVICE UPGRADE","3 JAHRE 24x7 6 STD WIEDERHERSTELLUNG","FÜR R2210 S2 BIS E5-264X",null,null,null,"X","X","X","X","X","X","X","X","X","X","X","X","X","X","X","X","X","X","X","X"]
[null,null,null,null,"740M6124",0,"GRAFENTHAL MPAC VOR ORT SERVICE UPGRADE","4 JAHRE 13x5 24 STD WIEDERHERSTELLUNG","FÜR R2210 S2 BIS E5-264X",null,null,null,"X","X","X","X","X","X","X","X","X","X","X","X","X","X","X","X","X","X","X","X"]
[null,null,null,null,"740M6125",0,"GRAFENTHAL MPAC VOR ORT SERVICE UPGRADE","4 JAHRE 13x5 12 STD WIEDERHERSTELLUNG","FÜR R2210 S2 BIS E5-264X",null,null,null,"X","X","X","X","X","X","X","X","X","X","X","X","X","X","X","X","X","X","X","X"]
[null,null,null,null,"740M6126",0,"GRAFENTHAL MPAC VOR ORT SERVICE UPGRADE","4 JAHRE 24x7 6 STD WIEDERHERSTELLUNG","FÜR R2210 S2 BIS E5-264X",null,null,null,"X","X","X","X","X","X","X","X","X","X","X","X","X","X","X","X","X","X","X","X"]
[null,null,null,null,"740M6127",0,"GRAFENTHAL MPAC VOR ORT SERVICE UPGRADE","5 JAHRE 13x5 24 STD WIEDERHERSTELLUNG","FÜR R2210 S2 BIS E5-264X",null,null,null,"X","X","X","X","X","X","X","X","X","X","X","X","X","X","X","X","X","X","X","X"]
[null,null,null,null,"740M6128",0,"GRAFENTHAL MPAC VOR ORT SERVICE UPGRADE","5 JAHRE 13x5 12 STD WIEDERHERSTELLUNG","FÜR R2210 S2 BIS E5-264X",null,null,null,"X","X","X","X","X","X","X","X","X","X","X","X","X","X","X","X","X","X","X","X"]
[null,null,null,null,"740M6129",0,"GRAFENTHAL MPAC VOR ORT SERVICE UPGRADE","5 JAHRE 24x7 6 STD WIEDERHERSTELLUNG","FÜR R2210 S2 BIS E5-264X",null,null,null,"X","X","X","X","X","X","X","X","X","X","X","X","X","X","X","X","X","X","X","X"]
[null,null,null,null,"740M6130",0,"GRAFENTHAL MPAC VOR ORT SERVICE UPGRADE","3 JAHRE 13x5 24STD WIEDERHERSTELLUNG DMR","FÜR R2210 S2 BIS E5-264X",null,null,null,"X","X","X","X","X","X","X","X","X","X","X","X","X","X","X","X","X","X","X","X"]
[null,null,null,null,"740M6131",0,"GRAFENTHAL MPAC VOR ORT SERVICE UPGRADE","3 JAHRE 13x5 12STD WIEDERHERSTELLUNG DMR","FÜR R2210 S2 BIS E5-264X",null,null,null,"X","X","X","X","X","X","X","X","X","X","X","X","X","X","X","X","X","X","X","X"]
[null,null,null,null,"740M6132",0,"GRAFENTHAL MPAC VOR ORT SERVICE UPGRADE","3 JAHRE 24x7 6 STD WIEDERHERSTELLUNG DMR","FÜR R2210 S2 BIS E5-264X",null,null,null,"X","X","X","X","X","X","X","X","X","X","X","X","X","X","X","X","X","X","X","X"]
[null,null,null,null,"740M6133",0,"GRAFENTHAL MPAC VOR ORT SERVICE UPGRADE","4 JAHRE 13x5 24STD WIEDERHERSTELLUNG DMR","FÜR R2210 S2 BIS E5-264X",null,null,null,"X","X","X","X","X","X","X","X","X","X","X","X","X","X","X","X","X","X","X","X"]
[null,null,null,null,"740M6134",0,"GRAFENTHAL MPAC VOR ORT SERVICE UPGRADE","4 JAHRE 13x5 12STD WIEDERHERSTELLUNG DMR","FÜR R2210 S2 BIS E5-264X",null,null,null,"X","X","X","X","X","X","X","X","X","X","X","X","X","X","X","X","X","X","X","X"]
[null,null,null,null,"740M6135",0,"GRAFENTHAL MPAC VOR ORT SERVICE UPGRADE","4 JAHRE 24x7 6 STD WIEDERHERSTELLUNG DMR","FÜR R2210 S2 BIS E5-264X",null,null,null,"X","X","X","X","X","X","X","X","X","X","X","X","X","X","X","X","X","X","X","X"]
[null,null,null,null,"740M6136",0,"GRAFENTHAL MPAC VOR ORT SERVICE UPGRADE","5 JAHRE 13x5 24STD WIEDERHERSTELLUNG DMR","FÜR R2210 S2 BIS E5-264X",null,null,null,"X","X","X","X","X","X","X","X","X","X","X","X","X","X","X","X","X","X","X","X"]
[null,null,null,null,"740M6137",0,"GRAFENTHAL MPAC VOR ORT SERVICE UPGRADE","5 JAHRE 13x5 12STD WIEDERHERSTELLUNG DMR","FÜR R2210 S2 BIS E5-264X",null,null,null,"X","X","X","X","X","X","X","X","X","X","X","X","X","X","X","X","X","X","X","X"]
[null,null,null,null,"740M6138",0,"GRAFENTHAL MPAC VOR ORT SERVICE UPGRADE","5 JAHRE 24x7 6 STD WIEDERHERSTELLUNG DMR","FÜR R2210 S2 BIS E5-264X",null,null,null,"X","X","X","X","X","X","X","X","X","X","X","X","X","X","X","X","X","X","X","X"]
[null,null,null,null,"CONFIG-TO-ORDER",{"$f":"SUM(F159:F162)","v":0}]
[null,null,null,null,"CTO",0,"HARDWARE ASSEMBLIERUNG",null,null,null,null,null,"X","X","X","X","X","X","X","X","X","X","X","X","X","X","X","X","X","X","X","X"]
[null,null,null,null,"CTO1",0,"HARDWARE ASSEMBLIERUNG & FIRMWARE UPDATE",null,null,null,null,null,"X","X","X","X","X","X","X","X","X","X","X","X","X","X","X","X","X","X","X","X"]
[null,null,null,null,"CTO2",0,"HARDWARE ASSEMBLIERUNG, FIRMWARE UPDATE & RAID EINRICHTUNG",null,null,null,null,null,"X","X","X","X","X","X","X","X","X","X","X","X","X","X","X","X","X","X","X","X"]
[null,null,null,null,"CTO3",0,"HARDWARE ASSEMBLIERUNG, FIRMWARE UPDATE, RAID EINRICHTUNG & OS INSTALLATION",null,null,null,null,null,"X","X","X","X","X","X","X","X","X","X","X","X","X","X","X","X","X","X","X","X"]
[null,null,null,null,"USB Drive",{"$f":"SUM(F164)","v":0}]
[null,null,null,null,"652G6004",0,"GRAFENTHAL USB 3.0 FLASH DRIVE","ULTRA FIT 64GB UP TO 150MB/S"," ",null,null,null,"X","X","X","X","X","X","X","X","X","X","X","X","X","X","X","X","X","X","X","X"]
[null,null,null,null,"USV- Systeme",{"$f":"SUM(F166:F169)","v":0}]
[null,null,null,null,"132G0150",0,"GRAFENTHAL USV ETR-1500 TOWER RACK LINE","INTERACTIVE 1500VA 1200W PURE SINEWAVE","ECO MODE 23KG CE ROHS GERMAN",null,null,null,"X","X","X","X","X","X","X","X","X","X","X","X","X","X","X","X","X","X","X","X"]
[null,null,null,null,"132G0300",0,"GRAFENTHAL USV ETR-3000 TOWER RACK LINE","INTERACTIVE 3000VA 2400W PURE SINEWAVE","ECO MODE 35KG CE ROHS GERMAN",null,null,null,"X","X","X","X","X","X","X","X","X","X","X","X","X","X","X","X","X","X","X","X"]
[null,null,null,null,"113G1150",0,"GRAFENTHAL USV PR-1500-HS PROGRAMMABLE","ECO MODE RACK MOUNT 2U USB RS232 LCD"," ",null,null,null,"X","X","X","X","X","X","X","X","X","X","X","X","X","X","X","X","X","X","X","X"]
[null,null,null,null,"113G1300",0,"GRAFENTHAL USV PR-3000-HS ONLINE","ECO MODE RACK MOUNT 2U USB RS232 LCD"," ",null,null,null,"X","X","X","X","X","X","X","X","X","X","X","X","X","X","X","X","X","X","X","X"]
[null,null,null,null,"USV- Zubehör",{"$f":"SUM(F171:F172)","v":0}]
[null,null,null,null,"149G6005",0,"GRAFENTHAL USV SNMP CARD PRO S2","FOR ETR AND PR AND PTR SERIES","MULTI SERVER SHUTDOWN",null,null,null,"X","X","X","X","X","X","X","X","X","X","X","X","X","X","X","X","X","X","X","X"]
[null,null,null,null,"149G5003",0,"GRAFENTHAL USV ACCESSORY LICENSE FOR","SNMP PRO CARD FOR ETR AND PR SERIES","MULTI SERVER SHUTDOWN",null,null,null,"X","X","X","X","X","X","X","X","X","X","X","X","X","X","X","X","X","X","X","X"]
[null,null,null,null,"SUMME",1,null,null,null,{"$f":"COUNTIF($J$174:$AF$174,\"<0\")","v":0}]
[null,null,null,null,null,null,null,null,null,{"$f":"SUM(J14:J172)","v":0},{"$f":"SUM(K14:K172)","v":0},{"$f":"SUM(L14:L172)","v":0},{"$f":"SUM(M14:M172)","v":0},0,0,0,0,0,0,0,0,0,0,0,0,0,0,0,0,0,0,0]

{"sheet":"R2216 S3","index":11,"n_rows":206,"n_cols":35,"rows_kept":206,"cut":false,"hidden":false,"merged":[[0,4,0,8]]}
[null,null,null,null,"2U Rackserver R2216 S3",null,null,null,null,null,null,"Konfigurator-Notizen R2216 S3",null,null,null,"obsolet",null,null,null,null,null,null,"obsolet"]
[null,null,null,null,null,null,null,null,null,null,null,"board 2 CPU slots","CPU-abhängig",null,null,"CPU 0","CPU 0/1","CPU 1",null,"CPU0",null,null,"backplane HotSwap","backplane HotSwap","backplane HotSwap","CPU 1","CPU0/CPU1"]
[null,null,null,null,null,null,null,"• Zwei CPU Sockets der Intel® Xeon® Scalable Prozessoren Produktfamilie ","more Info",null,null,"minimal (base)  1","base 12","base 32",null,"base","base","base","base",null,null,null,"base 1",null,null,"NVME ports","SAS /NVME ports"]
[null,null,null,null,null,null,null,"• Bis zu 1,5 TB DDR4 ECC Arbeitsspeicher",null,null,null,"CPU 0","Mem Slots","PCIe lanes","PCIe lanes Risercards","risercard 0","risercard 1","risercard 2","extens. card (max 8 )","intern nonHS","backplane 'slots'","backplane 'slots'","bp 0","bp 1","bp 2","ocu-links *4","raidctrl.","SATA auf raid ctrl","Cache","HotSwap slots 3,5\"","HotSwap slots 2,5\"","HotSwap slots 2,5\""]
[null,null,null,null,null,null,null,"• 16x HDD / SSD Bays für SAS und SATA Medien im 3,5“ und 2,5“ Format ",null,null,null,null,"(Menge x 12)","(Menge CPUs x 32 lanes)",null,"(+24 lanes)","(+8 / +16 lanes)","(+16 lanes)","(*-8 lanes)","M.2 (max 2 )","front","rear","cable pwr  bp0","cable pwr  bp1","cable pwr  bp2","( separate lanes)","(* -8 lanes)","mischbar","battery","physical","physical","physical"]
[null,null,null,null,null,null,null,"• Bis zu 128TB Storage Kapazität",null,null,null,null,null,"\"on board\"",null,"3 extens. slots","3 extens. slots","2 extens. Slots","(*-1 extens. Slot)","M.2.riser card (auto )","HS","HS","cable BMC bp0","cable BMC bp1","cable BMC bp2","dirves:","(* -1 exts. slot)","SAS ports abhängig von ",null,null,"NVME","SAS"]
[null,null,null,null,null,null,null,"• Redundante Platinum-Netzteile ","*) \"Menge\" filtern um Konfiguration anzuzeigen",null,null,null,null,null,null,null,null,null,"slots on risercard:","(separate lanes konkurrent: Ssata))",null,null,"SAS ports *8","SAS ports *8","SAS ports *8","(* -4 SAS ports","(* + $i SAS ports) ","tatsächlich verbauten "]
[null,null,null,null,null,null,null,null,"* Felder werden automatisch ausgefüllt",null,null,null,null,null,null,null,null,null,"0,0,1,0,1,1,2,2","drives","1 base",null,"cable SAS (2 x intern miniSAS -> OCU link)","cable SAS (2 x intern miniSAS -> OCU link)","cable SAS (2 x intern miniSAS -> OCU link)","(auto + cable)","(auto + cable)","SATA Platten"]
[null,null,null,null,null,null,null,null,null,"Fehlerzähler",null,null,null,null,null,null,null,null,null,"(*- 1 M.2 slot)",null,null,"SAS * 4 & NVME *2","SAS * 4 & NVME *2","(SAS * 4 & NVME *2)","(* +1 NVME port)"]
[null,null,null,null,null,"Die aktuelle Konfiguration ist fehlerhaft !",null,null,null,{"$f":"J205","v":0},null,null,null,null,null,null,null,null,null,null,null,null,"cable NVME (2 x OCUlink->OCUlink)","cable NVME (2 x OCUlink->OCUlink)","cable NVME (2 x OCUlink->OCUlink)"]
[null,null,null,null,"Konfigurator",null,{"$f":"'Revision Info'!B10","v":"Revision 15"},null,null,{"$f":"J206","v":0},{"$f":"K206","v":0},0,0,0,0,0,0,0,0,0,0,0,0,0,0,0,0,0,0,0,0,0,0,0,0]
[null,null,"LOGIK",null,"ART. NR.","Menge\n     *)","Bezeichnung","Bezeichnung II","Bezeichnung III","nicht kombinierbar","nicht konfigurierbar","CPU slots","MEM Slots","PCIe lanes for\nextension cards","PCIe lanes via RiserCards","RiserCard 0","RiserCard 1","RiserCard 2","extension slots","M.2slots via M.2-riser\nnon HS","Bckpl Slots Front","Bckpl Slots Rear","Spalte3","Spalte4","Spalte5","NVME-ports","SAS ports","SATA ports","Raid Cotroller Cache battery","HDD slots 3,5\"\nHS","HDD slots 2,5\"\nHS NVME","HDD slots 2,5\" \nHS SAS","DVD Slot","PSU Slot","OCP Conn C\nPHY-Card"]
[null,null,"status",null,"Maschinentyp",{"$f":"SUM(F14:F14)","v":0},"*mindestens eine Grundmaschine auswählen*",null,null,"if (Kombi);-1;0","if Menge;-1;0","(Menge x Eigenschaft)","(Menge x Eigenschaft)","(Menge x Eigenschaft)","(Menge x Eigenschaft)","(Menge x Eigenschaft)","(Menge x Eigenschaft)","(Menge x Eigenschaft)","(Menge x Eigenschaft)","(Menge x Eigenschaft)","(Menge x Eigenschaft)","(Menge x Eigenschaft)","(Menge x Eigenschaft)","(Menge x Eigenschaft)","(Menge x Eigenschaft)","(Menge x Eigenschaft)","(Menge x Eigenschaft)",null,"(MengexEigenschaft)","(Menge x Eigenschaft)","(Menge x Eigenschaft)","(Menge x Eigenschaft)","(Menge x Eigenschaft)","(Menge x Eigenschaft)","(Menge x Eigenschaft)"]
[null,null,null,null,"612G8203",0,"GRAFENTHAL CTO RACK SERVER 2U R2216 S3","2X SCALABLE XEON CPU 12x3,5'' 4x2,5\\ BAY\"","MAX 24xDIMMS 1/2 RED PSU 800W",null,{"$f":"IF(Tabelle438[[#This Row],[Menge\n     *)]]>1,-1,0)","v":0},{"$f":"Tabelle438[[#This Row],[Menge\n     *)]]*2","v":0},null,{"$f":"Tabelle438[[#This Row],[Menge\n     *)]]*0","v":0},{"$f":"Tabelle438[[#This Row],[Menge\n     *)]]*0","v":0},{"$f":"Tabelle438[[#This Row],[Menge\n     *)]]*0","v":0},{"$f":"Tabelle438[[#This Row],[Menge\n     *)]]*0","v":0},{"$f":"Tabelle438[[#This Row],[Menge\n     *)]]*0","v":0},{"$f":"Tabelle438[[#This Row],[Menge\n     *)]]*0","v":0},{"$f":"Tabelle438[[#This Row],[Menge\n     *)]]*2","v":0},{"$f":"Tabelle438[[#This Row],[Menge\n     *)]]*1","v":0},{"$f":"Tabelle438[[#This Row],[Menge\n     *)]]*1","v":0},{"$f":"Tabelle438[[#This Row],[Menge\n     *)]]*0","v":0},{"$f":"Tabelle438[[#This Row],[Menge\n     *)]]*0","v":0},{"$f":"Tabelle438[[#This Row],[Menge\n     *)]]*0","v":0},{"$f":"Tabelle438[[#This Row],[Menge\n     *)]]*0","v":0},{"$f":"Tabelle438[[#This Row],[Menge\n     *)]]*0","v":0},{"$f":"Tabelle438[[#This Row],[Menge\n     *)]]*0","v":0},{"$f":"Tabelle438[[#This Row],[Menge\n     *)]]*0","v":0},{"$f":"Tabelle438[[#This Row],[Menge\n     *)]]*0","v":0},{"$f":"Tabelle438[[#This Row],[Menge\n     *)]]*0","v":0},{"$f":"Tabelle438[[#This Row],[Menge\n     *)]]*0","v":0},{"$f":"Tabelle438[[#This Row],[Menge\n     *)]]*0","v":0},{"$f":"Tabelle438[[#This Row],[Menge\n     *)]]*2","v":0},{"$f":"Tabelle438[[#This Row],[Menge\n     *)]]*1","v":0}]
[null,null,null,null,"Prozessor",{"$f":"SUM(F16:F39)","v":0}," mindestens 1 CPU benötigt"]
[null,null,null,null,"656G8022",0,"GRAFENTHAL CPU XEON BRONZE 3104 1.70GHz","6C 8.25MB 85W"," ",{"$f":"IF(COUNTIF(F16:F39,\"<>0\")>1,-1,0)","v":0},null,{"$f":"Tabelle438[[#This Row],[Menge\n     *)]]*-1","v":0},{"$f":"Tabelle438[[#This Row],[Menge\n     *)]]*12","v":0},{"$f":"Tabelle438[[#This Row],[Menge\n     *)]]*32","v":0},null,null,null,null,null,null,null,null,null,null,null,{"$f":"IF(Tabelle438[[#This Row],[Menge\n     *)]]=2,4,0)","v":0}]
[null,null,null,null,"656G8024",0,"GRAFENTHAL CPU XEON SILVER 4108 1.80GHz","8C 11MB 85W"," ",null,null,{"$f":"Tabelle438[[#This Row],[Menge\n     *)]]*-1","v":0},{"$f":"Tabelle438[[#This Row],[Menge\n     *)]]*12","v":0},{"$f":"Tabelle438[[#This Row],[Menge\n     *)]]*32","v":0},null,null,null,null,null,null,null,null,null,null,null,{"$f":"IF(Tabelle438[[#This Row],[Menge\n     *)]]=2,4,0)","v":0}]
[null,null,null,null,"656G8026",0,"GRAFENTHAL CPU XEON SILVER 4110 2.10GHz","8C 11MB 85W"," ",null,null,{"$f":"Tabelle438[[#This Row],[Menge\n     *)]]*-1","v":0},{"$f":"Tabelle438[[#This Row],[Menge\n     *)]]*12","v":0},{"$f":"Tabelle438[[#This Row],[Menge\n     *)]]*32","v":0},null,null,null,null,null,null,null,null,null,null,null,{"$f":"IF(Tabelle438[[#This Row],[Menge\n     *)]]=2,4,0)","v":0}]
[null,null,null,null,"656G8025",0,"GRAFENTHAL CPU XEON SILVER 4114 3.00GHz","10C 13.75MB 85W"," ",null,null,{"$f":"Tabelle438[[#This Row],[Menge\n     *)]]*-1","v":0},{"$f":"Tabelle438[[#This Row],[Menge\n     *)]]*12","v":0},{"$f":"Tabelle438[[#This Row],[Menge\n     *)]]*32","v":0},null,null,null,null,null,null,null,null,null,null,null,{"$f":"IF(Tabelle438[[#This Row],[Menge\n     *)]]=2,4,0)","v":0}]
[null,null,null,null,"656G8028",0,"GRAFENTHAL CPU XEON SILVER 4116 2.10GHz","12C 16.5MB 85W"," ",null,null,{"$f":"Tabelle438[[#This Row],[Menge\n     *)]]*-1","v":0},{"$f":"Tabelle438[[#This Row],[Menge\n     *)]]*12","v":0},{"$f":"Tabelle438[[#This Row],[Menge\n     *)]]*32","v":0},null,null,null,null,null,null,null,null,null,null,null,{"$f":"IF(Tabelle438[[#This Row],[Menge\n     *)]]=2,4,0)","v":0}]
[null,null,null,null,"656G8030",0,"GRAFENTHAL CPU XEON GOLD 5118 2.30GHz","12C 16.5MB 105W"," ",null,null,{"$f":"Tabelle438[[#This Row],[Menge\n     *)]]*-1","v":0},{"$f":"Tabelle438[[#This Row],[Menge\n     *)]]*12","v":0},{"$f":"Tabelle438[[#This Row],[Menge\n     *)]]*32","v":0},null,null,null,null,null,null,null,null,null,null,null,{"$f":"IF(Tabelle438[[#This Row],[Menge\n     *)]]=2,4,0)","v":0}]
[null,null,null,null,"656G8031",0,"GRAFENTHAL CPU XEON GOLD 5120 2.20GHz","14C 19.25MB 105W"," ",null,null,{"$f":"Tabelle438[[#This Row],[Menge\n     *)]]*-1","v":0},{"$f":"Tabelle438[[#This Row],[Menge\n     *)]]*12","v":0},{"$f":"Tabelle438[[#This Row],[Menge\n     *)]]*32","v":0},null,null,null,null,null,null,null,null,null,null,null,{"$f":"IF(Tabelle438[[#This Row],[Menge\n     *)]]=2,4,0)","v":0}]
[null,null,null,null,"656G8033",0,"GRAFENTHAL CPU XEON GOLD 6126 2.60GHz","12C 19.20MB 125W"," ",null,null,{"$f":"Tabelle438[[#This Row],[Menge\n     *)]]*-1","v":0},{"$f":"Tabelle438[[#This Row],[Menge\n     *)]]*12","v":0},{"$f":"Tabelle438[[#This Row],[Menge\n     *)]]*32","v":0},null,null,null,null,null,null,null,null,null,null,null,{"$f":"IF(Tabelle438[[#This Row],[Menge\n     *)]]=2,4,0)","v":0}]
[null,null,null,null,"656G8034",0,"GRAFENTHAL CPU XEON GOLD 6128 3.40GHz","6C 19.25MB 115W"," ",null,null,{"$f":"Tabelle438[[#This Row],[Menge\n     *)]]*-1","v":0},{"$f":"Tabelle438[[#This Row],[Menge\n     *)]]*12","v":0},{"$f":"Tabelle438[[#This Row],[Menge\n     *)]]*32","v":0},null,null,null,null,null,null,null,null,null,null,null,{"$f":"IF(Tabelle438[[#This Row],[Menge\n     *)]]=2,4,0)","v":0}]
[null,null,null,null,"656G8035",0,"GRAFENTHAL CPU XEON GOLD 6130 2.10GHz","16C 22MB 125W"," ",null,null,{"$f":"Tabelle438[[#This Row],[Menge\n     *)]]*-1","v":0},{"$f":"Tabelle438[[#This Row],[Menge\n     *)]]*12","v":0},{"$f":"Tabelle438[[#This Row],[Menge\n     *)]]*32","v":0},null,null,null,null,null,null,null,null,null,null,null,{"$f":"IF(Tabelle438[[#This Row],[Menge\n     *)]]=2,4,0)","v":0}]
[null,null,null,null,"656G8036",0,"GRAFENTHAL CPU XEON GOLD 6132 2.60GHz","14C 19.25MB 140W"," ",null,null,{"$f":"Tabelle438[[#This Row],[Menge\n     *)]]*-1","v":0},{"$f":"Tabelle438[[#This Row],[Menge\n     *)]]*12","v":0},{"$f":"Tabelle438[[#This Row],[Menge\n     *)]]*32","v":0},null,null,null,null,null,null,null,null,null,null,null,{"$f":"IF(Tabelle438[[#This Row],[Menge\n     *)]]=2,4,0)","v":0}]
[null,null,null,null,"656G8037",0,"GRAFENTHAL CPU XEON GOLD 6134 3.20GHz","8C 24.75MB 130W"," ",null,null,{"$f":"Tabelle438[[#This Row],[Menge\n     *)]]*-1","v":0},{"$f":"Tabelle438[[#This Row],[Menge\n     *)]]*12","v":0},{"$f":"Tabelle438[[#This Row],[Menge\n     *)]]*32","v":0},null,null,null,null,null,null,null,null,null,null,null,{"$f":"IF(Tabelle438[[#This Row],[Menge\n     *)]]=2,4,0)","v":0}]
[null,null,null,null,"656G8040",0,"GRAFENTHAL CPU XEON GOLD 6140 2.30GHz","18C 24.70MB 140W"," ",null,null,{"$f":"Tabelle438[[#This Row],[Menge\n     *)]]*-1","v":0},{"$f":"Tabelle438[[#This Row],[Menge\n     *)]]*12","v":0},{"$f":"Tabelle438[[#This Row],[Menge\n     *)]]*32","v":0},null,null,null,null,null,null,null,null,null,null,null,{"$f":"IF(Tabelle438[[#This Row],[Menge\n     *)]]=2,4,0)","v":0}]
[null,null,null,null,"656G8041",0,"GRAFENTHAL CPU XEON GOLD 6142 2.60GHz","16C 22MB 150W"," ",null,null,{"$f":"Tabelle438[[#This Row],[Menge\n     *)]]*-1","v":0},{"$f":"Tabelle438[[#This Row],[Menge\n     *)]]*12","v":0},{"$f":"Tabelle438[[#This Row],[Menge\n     *)]]*32","v":0},null,null,null,null,null,null,null,null,null,null,null,{"$f":"IF(Tabelle438[[#This Row],[Menge\n     *)]]=2,4,0)","v":0}]
[null,null,null,null,"656G8042",0,"GRAFENTHAL CPU XEON GOLD 6144 3.50GHz","8C 24.75MB 150W"," ",null,null,{"$f":"Tabelle438[[#This Row],[Menge\n     *)]]*-1","v":0},{"$f":"Tabelle438[[#This Row],[Menge\n     *)]]*12","v":0},{"$f":"Tabelle438[[#This Row],[Menge\n     *)]]*32","v":0},null,null,null,null,null,null,null,null,null,null,null,{"$f":"IF(Tabelle438[[#This Row],[Menge\n     *)]]=2,4,0)","v":0}]
[null,null,null,null,"656G8043",0,"GRAFENTHAL CPU XEON GOLD 6146 3.20GHz","12C 24.75MB 165W"," ",null,null,{"$f":"Tabelle438[[#This Row],[Menge\n     *)]]*-1","v":0},{"$f":"Tabelle438[[#This Row],[Menge\n     *)]]*12","v":0},{"$f":"Tabelle438[[#This Row],[Menge\n     *)]]*32","v":0},null,null,null,null,null,null,null,null,null,null,null,{"$f":"IF(Tabelle438[[#This Row],[Menge\n     *)]]=2,4,0)","v":0}]
[null,null,null,null,"656G8044",0,"GRAFENTHAL CPU XEON GOLD 6148 2.40GHz","20C 27.5MB 150W"," ",null,null,{"$f":"Tabelle438[[#This Row],[Menge\n     *)]]*-1","v":0},{"$f":"Tabelle438[[#This Row],[Menge\n     *)]]*12","v":0},{"$f":"Tabelle438[[#This Row],[Menge\n     *)]]*32","v":0},null,null,null,null,null,null,null,null,null,null,null,{"$f":"IF(Tabelle438[[#This Row],[Menge\n     *)]]=2,4,0)","v":0}]
[null,null,null,null,"656G8046",0,"GRAFENTHAL CPU XEON GOLD 6152 2.10GHz","22C 30.25MB 140W"," ",null,null,{"$f":"Tabelle438[[#This Row],[Menge\n     *)]]*-1","v":0},{"$f":"Tabelle438[[#This Row],[Menge\n     *)]]*12","v":0},{"$f":"Tabelle438[[#This Row],[Menge\n     *)]]*32","v":0},null,null,null,null,null,null,null,null,null,null,null,{"$f":"IF(Tabelle438[[#This Row],[Menge\n     *)]]=2,4,0)","v":0}]
[null,null,null,null,"656G8048",0,"GRAFENTHAL CPU XEON PLATINUM 8153","2.00GHz 16C 22MB 125W"," ",null,null,{"$f":"Tabelle438[[#This Row],[Menge\n     *)]]*-1","v":0},{"$f":"Tabelle438[[#This Row],[Menge\n     *)]]*12","v":0},{"$f":"Tabelle438[[#This Row],[Menge\n     *)]]*32","v":0},null,null,null,null,null,null,null,null,null,null,null,{"$f":"IF(Tabelle438[[#This Row],[Menge\n     *)]]=2,4,0)","v":0}]
[null,null,null,null,"656G8049",0,"GRAFENTHAL CPU XEON PLATINUM 8156","3.60GHz 4C 16.5MB 105W"," ",null,null,{"$f":"Tabelle438[[#This Row],[Menge\n     *)]]*-1","v":0},{"$f":"Tabelle438[[#This Row],[Menge\n     *)]]*12","v":0},{"$f":"Tabelle438[[#This Row],[Menge\n     *)]]*32","v":0},null,null,null,null,null,null,null,null,null,null,null,{"$f":"IF(Tabelle438[[#This Row],[Menge\n     *)]]=2,4,0)","v":0}]
[null,null,null,null,"656G8051",0,"GRAFENTHAL CPU XEON PLATINUM 8160","2.10GHz 24C 33MB 150W"," ",null,null,{"$f":"Tabelle438[[#This Row],[Menge\n     *)]]*-1","v":0},{"$f":"Tabelle438[[#This Row],[Menge\n     *)]]*12","v":0},{"$f":"Tabelle438[[#This Row],[Menge\n     *)]]*32","v":0},null,null,null,null,null,null,null,null,null,null,null,{"$f":"IF(Tabelle438[[#This Row],[Menge\n     *)]]=2,4,0)","v":0}]
[null,null,null,null,"656G8053",0,"GRAFENTHAL CPU XEON PLATINUM 8164","2.00GHz 26C 35.75MB 150W"," ",null,null,{"$f":"Tabelle438[[#This Row],[Menge\n     *)]]*-1","v":0},{"$f":"Tabelle438[[#This Row],[Menge\n     *)]]*12","v":0},{"$f":"Tabelle438[[#This Row],[Menge\n     *)]]*32","v":0},null,null,null,null,null,null,null,null,null,null,null,{"$f":"IF(Tabelle438[[#This Row],[Menge\n     *)]]=2,4,0)","v":0}]
[null,null,null,null,"656G8055",0,"GRAFENTHAL CPU XEON PLATINUM 8176","2.10GHz 28C 38.5MB 165W"," ",null,null,{"$f":"Tabelle438[[#This Row],[Menge\n     *)]]*-1","v":0},{"$f":"Tabelle438[[#This Row],[Menge\n     *)]]*12","v":0},{"$f":"Tabelle438[[#This Row],[Menge\n     *)]]*32","v":0},null,null,null,null,null,null,null,null,null,null,null,{"$f":"IF(Tabelle438[[#This Row],[Menge\n     *)]]=2,4,0)","v":0}]
[null,null,null,null,"656G8056",0,"GRAFENTHAL CPU XEON PLATINUM 8180","2.50GHz 28C 38.5MB 205W"," ",null,null,{"$f":"Tabelle438[[#This Row],[Menge\n     *)]]*-1","v":0},{"$f":"Tabelle438[[#This Row],[Menge\n     *)]]*12","v":0},{"$f":"Tabelle438[[#This Row],[Menge\n     *)]]*32","v":0},null,null,null,null,null,null,null,null,null,null,null,{"$f":"IF(Tabelle438[[#This Row],[Menge\n     *)]]=2,4,0)","v":0}]
[null,null,null,null,"CPU-Zubehör",{"$f":"SUM(F41:F42)","v":0},""]
[null,null,null,null,"659G8001",{"$f":"IF(SUM($F$16:$F$39)>0,SUM($F$16:$F$39),0)","v":0},"GRAFENTHAL CPU COOLER FOR R2208 S3 /","R2216 S3"," "]
[null,null,null,null,"659G8014",{"$f":"F41","v":0},"GRAFENTHAL XEON SCALABLE CPU HOLDER TRAY"," "," "]
[null,null,null,null,"Arbeitsspeicher",{"$f":"SUM(F44:F46)","v":0},""]
[null,null,null,null,"652G8000",0,"GRAFENTHAL MEM 16GB DDR4-2666MHz RDIMM","PC4-21300 CL 19 DUAL RANKED ECC"," ",null,null,null,{"$f":"Tabelle438[[#This Row],[Menge\n     *)]]*-1","v":0}]
[null,null,null,null,"652G8001",0,"GRAFENTHAL MEM 32GB DDR4-2666MHz RDIMM","PC4-21300 CL19 DUAL RANKED ECC"," ",null,null,null,{"$f":"Tabelle438[[#This Row],[Menge\n     *)]]*-1","v":0}]
[null,null,null,null,"652G8002",0,"GRAFENTHAL MEM 64GB DDR4-2666MHz RDIMM","PC4-21300 CL19 DUAL RANKED ECC"," ",null,null,null,{"$f":"Tabelle438[[#This Row],[Menge\n     *)]]*-1","v":0}]
[null,null,null,null,"HDD Expansion (front)",{"$f":"SUM(#REF!)","v":{"$error":"#REF!"}},"base"]
[null,null,null,null,"HDD Expansion (rear)",{"$f":"SUM(#REF!)","v":{"$error":"#REF!"}},"base"]
[null,null,null,null,"Festplatten 3,5 \""]
[null,null,null,null,"SATA"]
[null,null,null,null,"SATA 3,5\" 7,2k 6GB/s",{"$f":"SUM(F52:F58)","v":0}]
[null,null,null,null,"651G8018",0,"GRAFENTHAL HDD 1TB SATA 3.5''","7.2K 6GB/S MTBF 2.5M HOURS 5Y WARRANTY"," ",null,null,null,null,null,null,null,null,null,null,null,null,null,null,null,null,null,null,{"$f":"Tabelle438[[#This Row],[Menge\n     *)]]*-1","v":0},null,{"$f":"Tabelle438[[#This Row],[Menge\n     *)]]*-1","v":0}]
[null,null,null,null,"651G8017",0,"GRAFENTHAL HDD 2TB SATA 3.5''","7.2K 6GB/S MTBF 2.5M HOURS 5Y WARRANTY"," ",null,null,null,null,null,null,null,null,null,null,null,null,null,null,null,null,null,null,{"$f":"Tabelle438[[#This Row],[Menge\n     *)]]*-1","v":0},null,{"$f":"Tabelle438[[#This Row],[Menge\n     *)]]*-1","v":0}]
[null,null,null,null,"651G8016",0,"GRAFENTHAL HDD 4TB SATA 3.5''","7.2K 6GB/S MTBF 2.5M HOURS 5Y WARRANTY"," ",null,null,null,null,null,null,null,null,null,null,null,null,null,null,null,null,null,null,{"$f":"Tabelle438[[#This Row],[Menge\n     *)]]*-1","v":0},null,{"$f":"Tabelle438[[#This Row],[Menge\n     *)]]*-1","v":0}]
[null,null,null,null,"651G8015",0,"GRAFENTHAL HDD 6TB SATA 3.5''","7.2K 6GB/S MTBF 2.5M HOURS 5Y WARRANTY"," ",null,null,null,null,null,null,null,null,null,null,null,null,null,null,null,null,null,null,{"$f":"Tabelle438[[#This Row],[Menge\n     *)]]*-1","v":0},null,{"$f":"Tabelle438[[#This Row],[Menge\n     *)]]*-1","v":0}]
[null,null,null,null,"651G8014",0,"GRAFENTHAL HDD 8TB SATA 3.5''","7.2K 6GB/S MTBF 2.5M HOURS 5Y WARRANTY"," ",null,null,null,null,null,null,null,null,null,null,null,null,null,null,null,null,null,null,{"$f":"Tabelle438[[#This Row],[Menge\n     *)]]*-1","v":0},null,{"$f":"Tabelle438[[#This Row],[Menge\n     *)]]*-1","v":0}]
[null,null,null,null,"651G8013",0,"GRAFENTHAL HDD 10TB SATA 3.5''","7.2K 6GB/S MTBF 2.5M HOURS 5Y WARRANTY"," ",null,null,null,null,null,null,null,null,null,null,null,null,null,null,null,null,null,null,{"$f":"Tabelle438[[#This Row],[Menge\n     *)]]*-1","v":0},null,{"$f":"Tabelle438[[#This Row],[Menge\n     *)]]*-1","v":0}]
[null,null,null,null,"651G8012",0,"GRAFENTHAL HDD 12TB SATA 3.5'' 7.2K","6GB/S MTBF 2.5M HOURS 5Y WARRANTY"," ",null,null,null,null,null,null,null,null,null,null,null,null,null,null,null,null,null,null,{"$f":"Tabelle438[[#This Row],[Menge\n     *)]]*-1","v":0},null,{"$f":"Tabelle438[[#This Row],[Menge\n     *)]]*-1","v":0}]
[null,null,null,null,"SAS"]
[null,null,null,null,"SAS 3,5\" 7,2k 12GB/s",{"$f":"SUM(F61:F65)","v":0}]
[null,null,null,null,"651G6021",0,"HDD 2TB SAS 7,2K 3,5“ 12GB/S 24/7","FOR GRAFENTHAL SERVER","MTTF 2.5M HOURS",null,null,null,null,null,null,null,null,null,null,null,null,null,null,null,null,null,{"$f":"Tabelle438[[#This Row],[Menge\n     *)]]*-1","v":0},null,null,{"$f":"Tabelle438[[#This Row],[Menge\n     *)]]*-1","v":0}]
[null,null,null,null,"651G6020",0,"GRAFENTHAL HDD 4TB SAS 7,2K 3,5“ 12GB/S","24/7","MTTF 2.5M HOURS",null,null,null,null,null,null,null,null,null,null,null,null,null,null,null,null,null,{"$f":"Tabelle438[[#This Row],[Menge\n     *)]]*-1","v":0},null,null,{"$f":"Tabelle438[[#This Row],[Menge\n     *)]]*-1","v":0}]
[null,null,null,null,"651G6019",0,"HDD 6TB SAS 7,2K 3,5“ 12GB/S 24/7","FOR GRAFENTHAL SERVER","MTTF 2.5M HOURS",null,null,null,null,null,null,null,null,null,null,null,null,null,null,null,null,null,{"$f":"Tabelle438[[#This Row],[Menge\n     *)]]*-1","v":0},null,null,{"$f":"Tabelle438[[#This Row],[Menge\n     *)]]*-1","v":0}]
[null,null,null,null,"651G6018",0,"HDD 8TB SAS 7,2K 3,5“ 12GB/S 24/7","FOR GRAFENTHAL SERVER","MTTF 2.5M HOURS",null,null,null,null,null,null,null,null,null,null,null,null,null,null,null,null,null,{"$f":"Tabelle438[[#This Row],[Menge\n     *)]]*-1","v":0},null,null,{"$f":"Tabelle438[[#This Row],[Menge\n     *)]]*-1","v":0}]
[null,null,null,null,"651G6016",0,"HDD 10TB SAS 7,2K 3,5“ 12GB/S 24/7","FOR GRAFENTHAL SERVER","MTTF 2.5M HOURS",null,null,null,null,null,null,null,null,null,null,null,null,null,null,null,null,null,{"$f":"Tabelle438[[#This Row],[Menge\n     *)]]*-1","v":0},null,null,{"$f":"Tabelle438[[#This Row],[Menge\n     *)]]*-1","v":0}]
[null,null,null,null,"Festplatten 2,5 \""]
[null,null,null,null,"SATA"]
[null,null,null,null,"SATA 2,5\" SSD 6GB/s *MIDRANGE*",{"$f":"SUM(F69:F70)","v":0}]
[null,null,null,null,"651G7011",0,"GRAFENTHAL SSD 240GB 2.5'' SATA 6GB/S","MIDRANGE 599 TBW"," ",null,null,null,null,null,null,null,null,null,null,null,null,null,null,null,null,null,null,{"$f":"Tabelle438[[#This Row],[Menge\n     *)]]*-1","v":0},null,null,null,{"$f":"Tabelle438[[#This Row],[Menge\n     *)]]*-1","v":0}]
[null,null,null,null,"651G7012",0,"GRAFENTHAL SSD 480GB 2.5'' SATA 6GB/S","MIDRANGE 945 TBW"," ",null,null,null,null,null,null,null,null,null,null,null,null,null,null,null,null,null,null,{"$f":"Tabelle438[[#This Row],[Menge\n     *)]]*-1","v":0},null,null,null,{"$f":"Tabelle438[[#This Row],[Menge\n     *)]]*-1","v":0}]
[null,null,null,null,"SATA 2,5\" SSD 6GB/s *ENTRY*",{"$f":"SUM(F72:F76)","v":0}]
[null,null,null,null,"651G8024",0,"GRAFENTHAL SSD 256GB SATA3 6GB/S 2.5''","MTBF 1.5M HOURS TBW 300TB"," ",null,null,null,null,null,null,null,null,null,null,null,null,null,null,null,null,null,null,{"$f":"Tabelle438[[#This Row],[Menge\n     *)]]*-1","v":0},null,null,null,{"$f":"Tabelle438[[#This Row],[Menge\n     *)]]*-1","v":0}]
[null,null,null,null,"651G8025",0,"GRAFENTHAL SSD 512GB SATA3 6GB/S 2.5''","MTBF 1.5M HOURS TBW 300TB"," ",null,null,null,null,null,null,null,null,null,null,null,null,null,null,null,null,null,null,{"$f":"Tabelle438[[#This Row],[Menge\n     *)]]*-1","v":0},null,null,null,{"$f":"Tabelle438[[#This Row],[Menge\n     *)]]*-1","v":0}]
[null,null,null,null,"651G8026",0,"GRAFENTHAL SSD 1TB SATA3 6GB/S 2.5''","MTBF 1.5M HOURS TBW 300TB"," ",null,null,null,null,null,null,null,null,null,null,null,null,null,null,null,null,null,null,{"$f":"Tabelle438[[#This Row],[Menge\n     *)]]*-1","v":0},null,null,null,{"$f":"Tabelle438[[#This Row],[Menge\n     *)]]*-1","v":0}]
[null,null,null,null,"651G8027",0,"GRAFENTHAL SSD 2TB SATA3 6GB/S 2.5''","MTBF 1.5M HOURS TBW 300TB"," ",null,null,null,null,null,null,null,null,null,null,null,null,null,null,null,null,null,null,{"$f":"Tabelle438[[#This Row],[Menge\n     *)]]*-1","v":0},null,null,null,{"$f":"Tabelle438[[#This Row],[Menge\n     *)]]*-1","v":0}]
[null,null,null,null,"651G8010",0,"GRAFENTHAL SSD 240GB 2,5'' SFF SATA 6G","READ 320MB WRITE 300MB"," ",null,null,null,null,null,null,null,null,null,null,null,null,null,null,null,null,null,null,{"$f":"Tabelle438[[#This Row],[Menge\n     *)]]*-1","v":0},null,null,null,{"$f":"Tabelle438[[#This Row],[Menge\n     *)]]*-1","v":0}]
[null,null,null,null,"SAS"]
[null,null,null,null,"SAS 2,5\" 10k 12GB/s",{"$f":"SUM(F79:F84)","v":0}]
[null,null,null,null,"651G8005",0,"GRAFENTHAL HDD 600GB 10K 2.5\\ SAS 12GB/S\""," "," ",null,null,null,null,null,null,null,null,null,null,null,null,null,null,null,null,null,{"$f":"Tabelle438[[#This Row],[Menge\n     *)]]*-1","v":0},null,null,null,null,{"$f":"Tabelle438[[#This Row],[Menge\n     *)]]*-1","v":0}]
[null,null,null,null,"651G8006",0,"GRAFENTHAL HDD 900GB 10K 2.5\\ SAS 12GB/S\""," "," ",null,null,null,null,null,null,null,null,null,null,null,null,null,null,null,null,null,{"$f":"Tabelle438[[#This Row],[Menge\n     *)]]*-1","v":0},null,null,null,null,{"$f":"Tabelle438[[#This Row],[Menge\n     *)]]*-1","v":0}]
[null,null,null,null,"651G8007",0,"GRAFENTHAL HDD 1.2TB 10K 2.5\\ SAS 12GB/S\""," "," ",null,null,null,null,null,null,null,null,null,null,null,null,null,null,null,null,null,{"$f":"Tabelle438[[#This Row],[Menge\n     *)]]*-1","v":0},null,null,null,null,{"$f":"Tabelle438[[#This Row],[Menge\n     *)]]*-1","v":0}]
[null,null,null,null,"651G8020",0,"GRAFENTHAL HDD 300GB 10K 2.5'' SAS","12GB/S"," ",null,null,null,null,null,null,null,null,null,null,null,null,null,null,null,null,null,{"$f":"Tabelle438[[#This Row],[Menge\n     *)]]*-1","v":0},null,null,null,null,{"$f":"Tabelle438[[#This Row],[Menge\n     *)]]*-1","v":0}]
[null,null,null,null,"651G8021",0,"GRAFENTHAL HDD 1.8TB 10K 2.5'' SAS","12GB/S"," ",null,null,null,null,null,null,null,null,null,null,null,null,null,null,null,null,null,{"$f":"Tabelle438[[#This Row],[Menge\n     *)]]*-1","v":0},null,null,null,null,{"$f":"Tabelle438[[#This Row],[Menge\n     *)]]*-1","v":0}]
[null,null,null,null,"651G8022",0,"GRAFENTHAL HDD 2.4TB 10K 2.5'' SAS","12GB/S"," ",null,null,null,null,null,null,null,null,null,null,null,null,null,null,null,null,null,{"$f":"Tabelle438[[#This Row],[Menge\n     *)]]*-1","v":0},null,null,null,null,{"$f":"Tabelle438[[#This Row],[Menge\n     *)]]*-1","v":0}]
[null,null,null,null,"SAS 2,5\" 15k 12GB/s",{"$f":"SUM(F86:F88)","v":0}]
[null,null,null,null,"651G8003",0,"GRAFENTHAL HDD 300GB 15K 2.5\\ SAS 12GB/S\""," "," ",null,null,null,null,null,null,null,null,null,null,null,null,null,null,null,null,null,{"$f":"Tabelle438[[#This Row],[Menge\n     *)]]*-1","v":0},null,null,null,null,{"$f":"Tabelle438[[#This Row],[Menge\n     *)]]*-1","v":0}]
[null,null,null,null,"651G8004",0,"GRAFENTHAL HDD 600GB 15K 2.5\\ SAS 12GB/S\""," "," ",null,null,null,null,null,null,null,null,null,null,null,null,null,null,null,null,null,{"$f":"Tabelle438[[#This Row],[Menge\n     *)]]*-1","v":0},null,null,null,null,{"$f":"Tabelle438[[#This Row],[Menge\n     *)]]*-1","v":0}]
[null,null,null,null,"651G8019",0,"GRAFENTHAL HDD 900GB 15K 2.5'' SAS","12GB/S"," ",null,null,null,null,null,null,null,null,null,null,null,null,null,null,null,null,null,{"$f":"Tabelle438[[#This Row],[Menge\n     *)]]*-1","v":0},null,null,null,null,{"$f":"Tabelle438[[#This Row],[Menge\n     *)]]*-1","v":0}]
[null,null,null,null,"SAS 2,5\" SSD  12GB/s *ENTERPRISE*",{"$f":"SUM(F90:F93)","v":0}]
[null,null,null,null,"651G7004",0,"GRAFENTHAL SSD 480GB 2,5'' SAS 12GB/S","MIDRANGE DWPD 1"," ",null,null,null,null,null,null,null,null,null,null,null,null,null,null,null,null,null,{"$f":"Tabelle438[[#This Row],[Menge\n     *)]]*-1","v":0},null,null,null,null,{"$f":"Tabelle438[[#This Row],[Menge\n     *)]]*-1","v":0}]
[null,null,null,null,"651G7005",0,"GRAFENTHAL SSD 960GB 2,5'' SAS 12GB/S","MIDRANGE DWPD 1"," ",null,null,null,null,null,null,null,null,null,null,null,null,null,null,null,null,null,{"$f":"Tabelle438[[#This Row],[Menge\n     *)]]*-1","v":0},null,null,null,null,{"$f":"Tabelle438[[#This Row],[Menge\n     *)]]*-1","v":0}]
[null,null,null,null,"651G7006",0,"GRAFENTHAL SSD 1920GB 2,5'' SAS 12GB/S","MIDRANGE DWPD 1"," ",null,null,null,null,null,null,null,null,null,null,null,null,null,null,null,null,null,{"$f":"Tabelle438[[#This Row],[Menge\n     *)]]*-1","v":0},null,null,null,null,{"$f":"Tabelle438[[#This Row],[Menge\n     *)]]*-1","v":0}]
[null,null,null,null,"651G7007",0,"GRAFENTHAL SSD 3840GB 2,5'' SAS 12GB/S","MIDRANGE DWPD 1"," ",null,null,null,null,null,null,null,null,null,null,null,null,null,null,null,null,null,{"$f":"Tabelle438[[#This Row],[Menge\n     *)]]*-1","v":0},null,null,null,null,{"$f":"Tabelle438[[#This Row],[Menge\n     *)]]*-1","v":0}]
[null,null,null,null,"U2 NVMe (OCU-link) Raid - Key",{"$f":"SUM(F95)","v":0}]
[null,null,null,null,"659G8020",0,"GRAFENTHAL INTEL RAID INTERNAL KEY","RAID 0-1-5-10"," "]
[null,null,null,null,"M.2 SATA",{"$f":"SUM(F97)","v":0},""]
[null,null,null,null,"M.2 SSD SATA",{"$f":"SUM(F98:F98)","v":0}]
[null,null,null,null,"651G8023",0,"GRAFENTHAL M.2 SSD DC S3520 240GB"," "," ",null,null,null,null,null,null,null,null,null,null,{"$f":"Tabelle438[[#This Row],[Menge\n     *)]]*-1","v":0}]
[null,null,null,null,"Riser Card Expander M.2",{"$f":"SUM(F100:F100)","v":0}]
[null,null,null,null,"659G8019",{"$f":"IF(F98=0,0,1)","v":0},"GRAFENTHAL INTERNAL M.2 RISER CARD","2x SLOT"," "]
[null,null,null,null,"Riser Card Expander",{"$f":"SUM(F102:F104)","v":0}]
[null,null,null,null,"659G8016",{"$f":"IF($F$14=1,1,0)","v":0},"GRAFENTHAL PCI-E RISER CARD 3x SLOT x8"," "," ",null,null,null,null,{"$f":"IF($F$14=1,Tabelle438[[#This Row],[Menge\n     *)]]*-24,0)","v":0},{"$f":"Tabelle438[[#This Row],[Menge\n     *)]]*24","v":0},null,null,null,{"$f":"Tabelle438[[#This Row],[Menge\n     *)]]*3","v":0}]
[null,null,null,null,"659G8016",{"$f":"IF($F$14=1,1,0)","v":0},"GRAFENTHAL PCI-E RISER CARD 3x SLOT x8"," "," ",null,null,null,null,{"$f":"IF(SUM($F$16:$F$39)=2,Tabelle438[[#This Row],[Menge\n     *)]]*-24,IF($F$14=1,Tabelle438[[#This Row],[Menge\n     *)]]*-8,0))","v":0},{"$f":"IF(SUM($F$16:$F$39)=2,Tabelle438[[#This Row],[Menge\n     *)]]*24,Tabelle438[[#This Row],[Menge\n     *)]]*8)","v":0},null,null,null,{"$f":"Tabelle438[[#This Row],[Menge\n     *)]]*3","v":0}]
[null,null,null,null,"659G8018",0,"GRAFENTHAL INTERNAL PCIe RISER  2x SLOT"," "," ",null,{"$f":"IF(Tabelle438[[#This Row],[Menge\n     *)]],-1,0)","v":0}]
[null,null,null,null,"Raid Controller",{"$f":"SUM(F106:F109)","v":0},"mindestens 1 RAID Controller oder HBA benötigt"]
[null,null,null,null,"653G8000",0,"GRAFENTHAL RAID CONTROLLER PM8060 12GB","SAS 8-CH 2GB CACHE"," ",null,null,null,null,null,{"$f":"Tabelle438[[#This Row],[Menge\n     *)]]*-8","v":0},null,null,null,{"$f":"Tabelle438[[#This Row],[Menge\n     *)]]*-1","v":0},null,null,null,null,null,null,null,{"$f":"Tabelle438[[#This Row],[Menge\n     *)]]*8","v":0},null,{"$f":"Tabelle438[[#This Row],[Menge\n     *)]]*1","v":0}]
[null,null,null,null,"653G5008",0,"GRAFENTHAL RAID CONTROLLER SAS/SATA","12GB/S /6GB/S 8i NO CACHE"," ",null,null,null,null,null,{"$f":"Tabelle438[[#This Row],[Menge\n     *)]]*-8","v":0},null,null,null,{"$f":"Tabelle438[[#This Row],[Menge\n     *)]]*-1","v":0},null,null,null,null,null,null,null,{"$f":"(Tabelle438[[#This Row],[Menge\n     *)]]*8)-$F$67","v":0},{"$f":"IF($F$67=0,0,Tabelle438[[#This Row],[Menge\n     *)]]*8)","v":0}]
[null,null,null,null,"653G8002",0,"GRAFENTHAL RAID CONTROLLER SAS3108 8i","2GB CACHE"," ",null,null,null,null,null,{"$f":"Tabelle438[[#This Row],[Menge\n     *)]]*-8","v":0},null,null,null,{"$f":"Tabelle438[[#This Row],[Menge\n     *)]]*-1","v":0},null,null,null,null,null,null,null,{"$f":"Tabelle438[[#This Row],[Menge\n     *)]]*8","v":0}]
[null,null,null,null,"653G8003",0,"GRAFENTHAL RAID CONTROLLER SAS3108 16i","2GB CACHE"," ",null,null,null,null,null,{"$f":"Tabelle438[[#This Row],[Menge\n     *)]]*-8","v":0},null,null,null,{"$f":"Tabelle438[[#This Row],[Menge\n     *)]]*-1","v":0},null,null,null,null,null,null,null,{"$f":"Tabelle438[[#This Row],[Menge\n     *)]]*16","v":0}]
[null,null,null,null,"Raid Controller - Zubehör",{"$f":"SUM(F111:F111)","v":0},""]
[null,null,null,null,"653G8001",0,"GRAFENTHAL RAID CONTROLLER BATTERY","BACK UP UNIT FOR 653G8000"," ",null,null,null,null,null,null,null,null,null,null,null,null,null,null,null,null,null,null,null,{"$f":"Tabelle438[[#This Row],[Menge\n     *)]]*-1","v":0}]
[null,null,null,null,"Kabel?",{"$f":"SUM(F113:F119)","v":0}]
[null,null,null,null,"folgen",0,{"$error":"#N/A"},{"$error":"#N/A"},{"$error":"#N/A"}]
[null,null,null,null,"folgen",0,{"$error":"#N/A"},{"$error":"#N/A"},{"$error":"#N/A"}]
[null,null,null,null,"folgen",0,{"$error":"#N/A"},{"$error":"#N/A"},{"$error":"#N/A"}]
[null,null,null,null,"folgen",0,{"$error":"#N/A"},{"$error":"#N/A"},{"$error":"#N/A"}]
[null,null,null,null,"folgen",0,{"$error":"#N/A"},{"$error":"#N/A"},{"$error":"#N/A"}]
[null,null,null,null,"folgen",0,{"$error":"#N/A"},{"$error":"#N/A"},{"$error":"#N/A"}]
[null,null,null,null,"folgen",0,{"$error":"#N/A"},{"$error":"#N/A"},{"$error":"#N/A"}]
[null,null,null,null,"HBA SAS",{"$f":"SUM(F121:F127)","v":0}]
[null,null,null,null,"folgen",0,{"$error":"#N/A"},{"$error":"#N/A"},{"$error":"#N/A"},null,null,null,null,null,null,null,null,null,{"$f":"Tabelle438[[#This Row],[Menge\n     *)]]*-1","v":0}]
[null,null,null,null,"folgen",0,{"$error":"#N/A"},{"$error":"#N/A"},{"$error":"#N/A"},null,null,null,null,null,null,null,null,null,{"$f":"Tabelle438[[#This Row],[Menge\n     *)]]*-1","v":0}]
[null,null,null,null,"folgen",0,{"$error":"#N/A"},{"$error":"#N/A"},{"$error":"#N/A"},null,null,null,null,null,null,null,null,null,{"$f":"Tabelle438[[#This Row],[Menge\n     *)]]*-1","v":0}]
[null,null,null,null,"folgen",0,{"$error":"#N/A"},{"$error":"#N/A"},{"$error":"#N/A"},null,null,null,null,null,null,null,null,null,{"$f":"Tabelle438[[#This Row],[Menge\n     *)]]*-1","v":0}]
[null,null,null,null,"folgen",0,{"$error":"#N/A"},{"$error":"#N/A"},{"$error":"#N/A"},null,null,null,null,null,null,null,null,null,{"$f":"Tabelle438[[#This Row],[Menge\n     *)]]*-1","v":0}]
[null,null,null,null,"folgen",0,{"$error":"#N/A"},{"$error":"#N/A"},{"$error":"#N/A"},null,null,null,null,null,null,null,null,null,{"$f":"Tabelle438[[#This Row],[Menge\n     *)]]*-1","v":0}]
[null,null,null,null,"folgen",0,{"$error":"#N/A"},{"$error":"#N/A"},{"$error":"#N/A"},null,null,null,null,null,null,null,null,null,{"$f":"Tabelle438[[#This Row],[Menge\n     *)]]*-1","v":0}]
[null,null,null,null,"(Kupfer-) Netzkarte",{"$f":"SUM(F129:F130)","v":0}]
[null,null,null,null,"659G8015",0,"GRAFENTHAL GIGABIT ETHERNET APDATER","I350-T4V2 4x RJ-45 PCIe x4 COPPER"," ",null,null,null,null,null,null,null,null,null,{"$f":"Tabelle438[[#This Row],[Menge\n     *)]]*-1","v":0}]
[null,null,null,null,"653G7002",0,"GRAFENTHAL ETHERNET ADAPTER DUAL PORT","RJ45 2x10GBE X550-T2 PCIe 3.0 x4"," ",null,null,null,null,null,null,null,null,null,{"$f":"Tabelle438[[#This Row],[Menge\n     *)]]*-1","v":0}]
[null,null,null,null,"(Kupfer-) Netzkarte - PHY-card",{"$f":"SUM(F132:F132)","v":0}]
[null,null,null,null,"653G8004",0,"GRAFENTHAL ETHERNET CARD PHY 4x1GB/S","COPPER FOR R2208 S3 / R2216 S3"," ",null,null,null,null,null,null,null,null,null,null,null,null,null,null,null,null,null,null,null,null,null,null,null,null,null,{"$f":"Tabelle438[[#This Row],[Menge\n     *)]]*-1","v":0}]
[null,null,null,null,"(SFP+)Netzwerkkarte",{"$f":"SUM(F134:F135)","v":0}]
[null,null,null,null,"653G7000",0,"GRAFENTHAL ETHERNET ADAPTER DUAL PORT","QSFP+ 2x10GBE/40GBE PCIe 3.0 x8 XL710-QD"," ",null,null,null,null,null,null,null,null,null,{"$f":"Tabelle438[[#This Row],[Menge\n     *)]]*-1","v":0}]
[null,null,null,null,"653G7003",0,"GRAFENTHAL ETHERNET ADAPTER 2-PORT 10GBE","INTEL X520 FIBRE SFP+ PCIe x8 LP"," ",null,null,null,null,null,null,null,null,null,{"$f":"Tabelle438[[#This Row],[Menge\n     *)]]*-1","v":0}]
[null,null,null,null,"PSU",{"$f":"SUM(F137:F139)","v":0}]
[null,null,null,null,"654G8001",{"$f":"IF(SUM(F14:F14)>0,IF(SUM(F139:F139)>0,0,1),0)","v":0},"GRAFENTHAL PSU 800W PLATINUM RED","FOR R2208 S3 / R2216 S3"," ",null,null,null,null,null,null,null,null,null,null,null,null,null,null,null,null,null,null,null,null,null,null,null,null,{"$f":"Tabelle438[[#This Row],[Menge\n     *)]]*-1","v":0}]
[null,null,null,null,"654G8001",0,"GRAFENTHAL PSU 800W PLATINUM RED","FOR R2208 S3 / R2216 S3",null,null,null,null,null,null,null,null,null,null,null,null,null,null,null,null,null,null,null,null,null,null,null,null,null,{"$f":"Tabelle438[[#This Row],[Menge\n     *)]]*-1","v":0}]
[null,null,null,null,"654G8002",0,"GRAFENTHAL PSU 1300W PLATINUM RED"," "," ",null,null,null,null,null,null,null,null,null,null,null,null,null,null,null,null,null,null,null,null,null,null,null,null,{"$f":"Tabelle438[[#This Row],[Menge\n     *)]]*-1","v":0}]
[null,null,null,null,"Open-E",{"$f":"SUM(F141:F152)","v":0}]
[null,null,null,null,1701,0,"OPEN-E DSS V7 STORAGE SOFTWARE OS, 4TB"," "]
[null,null,null,null,1702,0,"OPEN-E DSS V7 STORAGE SOFTWARE OS, 8TB"," "]
[null,null,null,null,1703,0,"OPEN-E DSS V7 STORAGE SOFTWARE OS, 16TB"," "]
[null,null,null,null,1704,0,"OPEN-E DSS V7 STORAGE SOFTWARE OS,","UNLIMITED TB"]
[null,null,null,null,1719,0,"OPEN-E FEATURE PACK-ACTIVE iSCSI,","FAILOVER V7 ONLY TWO LICENSE KEY"]
[null,null,null,null,1775,0,"OPEN-E STANDARD SUPPORT, 1 YEAR,","8 BUSINESS HR PHONE OR EMAIL"]
[null,null,null,null,1776,0,"OPEN-E PREMIUM SUPPORT, 1 YEAR","4 BUSINESS HR PHONE EMAIL REMOTE CONSOLE"]
[null,null,null,null,1777,0,"OPEN-E 24/7 SUPPORT,3 YEARS,4 BUSI. HR.","UP TO 4H AFTER SUBMISSION OF TICKET"]
[null,null,null,null,1778,0,"OPEN-E UPGRADE TO 3 YEARS BASIC SUPPORT"," "]
[null,null,null,null,1779,0,"OPEN-E UPGRADE TO 3 YEARS STANDARD","SUPPORT"]
[null,null,null,null,1780,0,"OPEN-E UPGRADE TO 3 YEARS PREMIUM","SUPPORT"]
[null,null,null,null,1781,0,"OPEN-E 24/7 SUPPORT,3 YEARS,4 BUSI. HR.","UP TO 4H AFTER SUBMISSION OF TICKET"]
[null,null,null,null,"MPAC",{"$f":"SUM(F154:F189)","v":0}]
[null,null,null,null,"740M6037",0,"GRAFENTHAL MPAC VOR ORT SERVICE UPGRADE","3JAHRE 13x5 24STD  WIEDERHERSTELLUNG","FÜR GRAFENTHAL R2208 S2 AB E5-2650"]
[null,null,null,null,"740M6038",0,"GRAFENTHAL MPAC VOR ORT SERVICE UPGRADE","3JAHRE 13x5 12STD  WIEDERHERSTELLUNG FÜR","FÜR GRAFENTHAL R2208 S2 AB E5-2650"]
[null,null,null,null,"740M6039",0,"GRAFENTHAL MPAC VOR ORT SERVICE UPGRADE","3JAHRE 24x7 6 STD  WIEDERHERSTELLUNG FÜR","FÜR GRAFENTHAL R2208 S2 AB E5-2650"]
[null,null,null,null,"740M6040",0,"GRAFENTHAL MPAC VOR ORT SERVICE UPGRADE","4JAHRE 13x5 24STD  WIEDERHERSTELLUNG FÜR","FÜR GRAFENTHAL R2208 S2 AB E5-2650"]
[null,null,null,null,"740M6041",0,"GRAFENTHAL MPAC VOR ORT SERVICE UPGRADE","4JAHRE 13x5 12STD  WIEDERHERSTELLUNG FÜR","FÜR GRAFENTHAL R2208 S2 AB E5-2650"]
[null,null,null,null,"740M6042",0,"GRAFENTHAL MPAC VOR ORT SERVICE UPGRADE","4JAHRE 24x7 6 STD  WIEDERHERSTELLUNG FÜR","FÜR GRAFENTHAL R2208 S2 AB E5-2650"]
[null,null,null,null,"740M6043",0,"GRAFENTHAL MPAC VOR ORT SERVICE UPGRADE","5JAHRE 13x5 24STD  WIEDERHERSTELLUNG FÜR","FÜR GRAFENTHAL R2208 S2 AB E5-2650"]
[null,null,null,null,"740M6044",0,"GRAFENTHAL MPAC VOR ORT SERVICE UPGRADE","5JAHRE 13x5 12STD  WIEDERHERSTELLUNG FÜR","FÜR GRAFENTHAL R2208 S2 AB E5-2650"]
[null,null,null,null,"740M6045",0,"GRAFENTHAL MPAC VOR ORT SERVICE UPGRADE","5JAHRE 24x7 6 STD  WIEDERHERSTELLUNG FÜR","FÜR GRAFENTHAL R2208 S2 AB E5-2650"]
[null,null,null,null,"740M6088",0,"GRAFENTHAL MPAC VOR ORT SERVICE UPGRADE","3JAHRE 13x5 24STD  WIEDERHERSTELLUNG DMR","FÜR GRAFENTHAL R2208 S2 AB E5-2650"]
[null,null,null,null,"740M6089",0,"GRAFENTHAL MPAC VOR ORT SERVICE UPGRADE","3JAHRE 13x5 12STD  WIEDERHERSTELLUNG DMR","FÜR GRAFENTHAL R2208 S2 AB E5-2650"]
[null,null,null,null,"740M6090",0,"GRAFENTHAL MPAC VOR ORT SERVICE UPGRADE","3JAHRE 24x7 6 STD  WIEDERHERSTELLUNG DMR","FÜR GRAFENTHAL R2208 S2 AB E5-2650"]
[null,null,null,null,"740M6091",0,"GRAFENTHAL MPAC VOR ORT SERVICE UPGRADE","4JAHRE 13x5 24STD  WIEDERHERSTELLUNG DMR","FÜR GRAFENTHAL R2208 S2 AB E5-2650"]
[null,null,null,null,"740M6092",0,"GRAFENTHAL MPAC VOR ORT SERVICE UPGRADE","4JAHRE 13x5 12STD  WIEDERHERSTELLUNG DMR","FÜR GRAFENTHAL R2208 S2 AB E5-2650"]
[null,null,null,null,"740M6093",0,"GRAFENTHAL MPAC VOR ORT SERVICE UPGRADE","4JAHRE 24x7 6 STD  WIEDERHERSTELLUNG DMR","FÜR GRAFENTHAL R2208 S2 AB E5-2650"]
[null,null,null,null,"740M6094",0,"GRAFENTHAL MPAC VOR ORT SERVICE UPGRADE","5JAHRE 13x5 24STD  WIEDERHERSTELLUNG DMR","FÜR GRAFENTHAL R2208 S2 AB E5-2650"]
[null,null,null,null,"740M6095",0,"GRAFENTHAL MPAC VOR ORT SERVICE UPGRADE","5JAHRE 13x5 12STD  WIEDERHERSTELLUNG DMR","FÜR GRAFENTHAL R2208 S2 AB E5-2650"]
[null,null,null,null,"740M6096",0,"GRAFENTHAL MPAC VOR ORT SERVICE UPGRADE","5JAHRE 24x7 6 STD  WIEDERHERSTELLUNG DMR","FÜR GRAFENTHAL R2208 S2 AB E5-2650"]
[null,null,null,null,"740M6028",0,"GRAFENTHAL MPAC VOR ORT SERVICE UPGRADE","3JAHRE 13x5 24STD  WIEDERHERSTELLUNG FÜR","FÜR GRAFENTHAL R2208 S2 BIS E5-264X"]
[null,null,null,null,"740M6029",0,"GRAFENTHAL MPAC VOR ORT SERVICE UPGRADE","3JAHRE 13x5 12STD  WIEDERHERSTELLUNG FÜR","FÜR GRAFENTHAL R2208 S2 BIS E5-264X"]
[null,null,null,null,"740M6030",0,"GRAFENTHAL MPAC VOR ORT SERVICE UPGRADE","3JAHRE 24x7 6 STD  WIEDERHERSTELLUNG FÜR","FÜR GRAFENTHAL R2208 S2 BIS E5-264X"]
[null,null,null,null,"740M6031",0,"GRAFENTHAL MPAC VOR ORT SERVICE UPGRADE","4JAHRE 13x5 24STD  WIEDERHERSTELLUNG FÜR","FÜR GRAFENTHAL R2208 S2 BIS E5-264X"]
[null,null,null,null,"740M6032",0,"GRAFENTHAL MPAC VOR ORT SERVICE UPGRADE","4JAHRE 13x5 12STD  WIEDERHERSTELLUNG FÜR","FÜR GRAFENTHAL R2208 S2 BIS E5-264X"]
[null,null,null,null,"740M6033",0,"GRAFENTHAL MPAC VOR ORT SERVICE UPGRADE","4JAHRE 24x7 6 STD  WIEDERHERSTELLUNG FÜR","FÜR GRAFENTHAL R2208 S2 BIS E5-264X"]
[null,null,null,null,"740M6034",0,"GRAFENTHAL MPAC VOR ORT SERVICE UPGRADE","5JAHRE 13x5 24STD  WIEDERHERSTELLUNG FÜR","FÜR GRAFENTHAL R2208 S2 BIS E5-264X"]
[null,null,null,null,"740M6035",0,"GRAFENTHAL MPAC VOR ORT SERVICE UPGRADE","5JAHRE 13x5 12STD  WIEDERHERSTELLUNG FÜR","FÜR GRAFENTHAL R2208 S2 BIS E5-264X"]
[null,null,null,null,"740M6036",0,"GRAFENTHAL MPAC VOR ORT SERVICE UPGRADE","5JAHRE 24x7 6 STD  WIEDERHERSTELLUNG FÜR","FÜR GRAFENTHAL R2208 S2 BIS E5-264X"]
[null,null,null,null,"740M6079",0,"GRAFENTHAL MPAC VOR ORT SERVICE UPGRADE","3JAHRE 13x5 24STD  WIEDERHERSTELLUNG DMR","FÜR GRAFENTHAL R2208 S2 BIS E5-264X"]
[null,null,null,null,"740M6080",0,"GRAFENTHAL MPAC VOR ORT SERVICE UPGRADE","3JAHRE 13x5 12STD  WIEDERHERSTELLUNG DMR","FÜR GRAFENTHAL R2208 S2 BIS E5-264X"]
[null,null,null,null,"740M6081",0,"GRAFENTHAL MPAC VOR ORT SERVICE UPGRADE","3JAHRE 24x7 6 STD  WIEDERHERSTELLUNG DMR","FÜR GRAFENTHAL R2208 S2 BIS E5-264X"]
[null,null,null,null,"740M6082",0,"GRAFENTHAL MPAC VOR ORT SERVICE UPGRADE","4JAHRE 13x5 24STD  WIEDERHERSTELLUNG DMR","FÜR GRAFENTHAL R2208 S2 BIS E5-264X"]
[null,null,null,null,"740M6083",0,"GRAFENTHAL MPAC VOR ORT SERVICE UPGRADE","4JAHRE 13x5 12STD  WIEDERHERSTELLUNG DMR","FÜR GRAFENTHAL R2208 S2 BIS E5-264X"]
[null,null,null,null,"740M6084",0,"GRAFENTHAL MPAC VOR ORT SERVICE UPGRADE","4JAHRE 24x7 6 STD  WIEDERHERSTELLUNG DMR","FÜR GRAFENTHAL R2208 S2 BIS E5-264X"]
[null,null,null,null,"740M6085",0,"GRAFENTHAL MPAC VOR ORT SERVICE UPGRADE","5JAHRE 13x5 24STD  WIEDERHERSTELLUNG DMR","FÜR GRAFENTHAL R2208 S2 BIS E5-264X"]
[null,null,null,null,"740M6086",0,"GRAFENTHAL MPAC VOR ORT SERVICE UPGRADE","5JAHRE 13x5 12STD  WIEDERHERSTELLUNG DMR","FÜR GRAFENTHAL R2208 S2 BIS E5-264X"]
[null,null,null,null,"740M6087",0,"GRAFENTHAL MPAC VOR ORT SERVICE UPGRADE","5JAHRE 24x7 6 STD  WIEDERHERSTELLUNG DMR","FÜR GRAFENTHAL R2208 S2 BIS E5-264X"]
[null,null,null,null,"CONFIG-TO-ORDER",{"$f":"SUM(F191:F194)","v":0}]
[null,null,null,null,"CTO",0,"HARDWARE ASSEMBLIERUNG"]
[null,null,null,null,"CTO1",0,"HARDWARE ASSEMBLIERUNG & FIRMWARE UPDATE"]
[null,null,null,null,"CTO2",0,"HARDWARE ASSEMBLIERUNG, FIRMWARE UPDATE & RAID EINRICHTUNG"]
[null,null,null,null,"CTO3",0,"HARDWARE ASSEMBLIERUNG, FIRMWARE UPDATE, RAID EINRICHTUNG & OS INSTALLATION"]
[null,null,null,null,"USB Drive",{"$f":"SUM(F196:F196)","v":0}]
[null,null,null,null,"652G6004",0,"GRAFENTHAL USB 3.0 FLASH DRIVE","ULTRA FIT 64GB UP TO 150MB/S"," "]
[null,null,null,null,"USV- Systeme",{"$f":"SUM(F198:F201)","v":0}]
[null,null,null,null,"132G0150",0,"GRAFENTHAL USV ETR-1500 TOWER RACK LINE","INTERACTIVE 1500VA 1200W PURE SINEWAVE","ECO MODE 23KG CE ROHS GERMAN"]
[null,null,null,null,"132G0300",0,"GRAFENTHAL USV ETR-3000 TOWER RACK LINE","INTERACTIVE 3000VA 2400W PURE SINEWAVE","ECO MODE 35KG CE ROHS GERMAN"]
[null,null,null,null,"113G1150",0,"GRAFENTHAL USV PR-1500-HS PROGRAMMABLE","ECO MODE RACK MOUNT 2U USB RS232 LCD"," "]
[null,null,null,null,"113G1300",0,"GRAFENTHAL USV PR-3000-HS ONLINE","ECO MODE RACK MOUNT 2U USB RS232 LCD"," "]
[null,null,null,null,"USV- Zubehör",{"$f":"SUM(F203:F204)","v":0}]
[null,null,null,null,"149G6005",0,"GRAFENTHAL USV SNMP CARD PRO S2","FOR ETR AND PR AND PTR SERIES","MULTI SERVER SHUTDOWN"]
[null,null,null,null,"149G5003",0,"GRAFENTHAL USV ACCESSORY LICENSE FOR","SNMP PRO CARD FOR ETR AND PR SERIES","MULTI SERVER SHUTDOWN"]
[null,null,null,null,"SUMME",1,null,null,null,{"$f":"COUNTIF($J$206:$AI$206,\"<0\")","v":0}]
[null,null,null,null,null,null,null,null,null,{"$f":"SUM(J14:J204)","v":0},0,0,0,0,0,0,0,0,0,0,0,0,0,0,0,0,{"$f":"SUM(AA14:AA204)","v":0},0,0,0,0,0,0,0,0]

{"sheet":"W1900 S2","index":12,"n_rows":100,"n_cols":34,"rows_kept":100,"cut":false,"hidden":false,"merged":[[0,4,0,8]]}
[null,null,null,null,"Workstation W1900 S2"]
[]
[null,null,null,null,null,null,null,"• Intel® Xeon® Prozessoren der E3-1200 v6 Produktfamilie ","more Info"]
[null,null,null,null,null,null,null,"• Bis zu 64GB DDR4 RAM Arbeitsspeicher "]
[null,null,null,null,null,null,null,"• M.2 Storage Technologie "]
[null,null,null,null,null,null,null,"• Unterstützt NVIDIA® Quadro® und AMD® Radeon™ Pro"]
[null,null,null,null,null,null,null,null,"* Felder werden automatisch ausgefüllt"]
[null,null,null,null,null,null,null,null,"*) \"Menge\" filtern um Konfiguration anzuzeigen"]
[]
[]
[null,null,null,null,"Konfigurator",null,{"$f":"'Revision Info'!B10","v":"Revision 15"},null,null,null,null,null,null,null,null,"use disables","2 x PCIe x1",null,"intern","extern","intern",null,"extern"]
[null,null,null,null,"ART. NR.\n\n","Menge\n     *)","Bezeichnung","Bezeichnung II","Bezeichung III","nicht kombinierbar","nicht konfigurierbar","CPU SLOT","MEM Slots","PCI - Slots","PCIe x1 Slots2","PCIe 16_2 Slot x4","PCIe 16_2 Slot x8","PCIe x16 Slot x 16","HD Slots  3.5 SAS / SATA","HD Slots  2,5 SAS / SATA","HD Slots  2,5 SAS / SATA2","M.2 Slot\nnur intern","SAS ports HS extern ","SATA port  max.nutzbar","SATA port  ext.  (SSD v HDD)2","SATA Ports\nintern","M2.ports\nSATA","M2.ports\nPCIe","HDD Slots HS SATA","HDD Slots NHS SAS","HDD Slots NHS SATA","CacheCade","Cachevault","remote dongle"]
[null,null,null,null,"Maschinentyp",{"$f":"SUM(F14:F14)","v":0},null,null,null,"if (Kombi);-1;0","if Menge;-1;0","(Menge x Eigenschaft)","(Menge x Eigenschaft)","(Menge x Eigenschaft)","(Menge x Eigenschaft)","(Menge x Eigenschaft)","(Menge x Eigenschaft)","(Menge x Eigenschaft)","(Menge x Eigenschaft)","(Menge x Eigenschaft)","(Menge x Eigenschaft)","(Menge x Eigenschaft)","(Menge x Eigenschaft)","(Menge x Eigenschaft)","(Menge x Eigenschaft)","(Menge x Eigenschaft)","(Menge x Eigenschaft)","(Menge x Eigenschaft)","(Menge x Eigenschaft)","(Menge x Eigenschaft)","(Menge x Eigenschaft)","(Menge x Eigenschaft)","(Menge x Eigenschaft)","(Menge x Eigenschaft)"]
[null,null,null,null,"722G8000",0,"GRAFENTHAL CTO WORKSTATION W1900 S2","1 SOCKET INTEL CPU 4xMEM SLOTS 3x3.5\\\";HDD 1x2.5\\\" HDD BAY SINGLE PSU 500W\"","",null,null,{"$f":"Tabelle212172[[#This Row],[Menge\n     *)]]*1","v":0},{"$f":"Tabelle212172[[#This Row],[Menge\n     *)]]*4","v":0},{"$f":"Tabelle212172[[#This Row],[Menge\n     *)]]*3","v":0},{"$f":"Tabelle212172[[#This Row],[Menge\n     *)]]*2","v":0},{"$f":"Tabelle212172[[#This Row],[Menge\n     *)]]*1","v":0},{"$f":"Tabelle212172[[#This Row],[Menge\n     *)]]*0","v":0},{"$f":"Tabelle212172[[#This Row],[Menge\n     *)]]*1","v":0},{"$f":"Tabelle212172[[#This Row],[Menge\n     *)]]*3","v":0},{"$f":"Tabelle212172[[#This Row],[Menge\n     *)]]*0","v":0},{"$f":"Tabelle212172[[#This Row],[Menge\n     *)]]*1","v":0},{"$f":"Tabelle212172[[#This Row],[Menge\n     *)]]*1","v":0},{"$f":"Tabelle212172[[#This Row],[Menge\n     *)]]*0","v":0},{"$f":"Tabelle212172[[#This Row],[Menge\n     *)]]*5","v":0},{"$f":"Tabelle212172[[#This Row],[Menge\n     *)]]*0","v":0},{"$f":"Tabelle212172[[#This Row],[Menge\n     *)]]*6","v":0},{"$f":"Tabelle212172[[#This Row],[Menge\n     *)]]*1","v":0},{"$f":"Tabelle212172[[#This Row],[Menge\n     *)]]*1","v":0},"X","X","X","X","X","X"]
[null,null,null,null,"Prozessor",{"$f":"SUM(F16:F30)","v":0}]
[null,null,null,null,"656G8000",0,"GRAFENTHAL CPU XEON E3-1220v6 3.00GHz 4C","8MB 72W"," ",{"$f":"IF(COUNTIF(F16:F30,\">0\")>1,-1,0)","v":0},null,{"$f":"Tabelle212172[[#This Row],[Menge\n     *)]]*-1","v":0}]
[null,null,null,null,"656G8001",0,"GRAFENTHAL CPU XEON E3-1230v6 3.50GHz 4C","8MB 72W"," ",null,null,{"$f":"Tabelle212172[[#This Row],[Menge\n     *)]]*-1","v":0}]
[null,null,null,null,"656G8002",0,"GRAFENTHAL CPU XEON E3-1240v6 3.70GHz 4C","8MB 72W"," ",null,null,{"$f":"Tabelle212172[[#This Row],[Menge\n     *)]]*-1","v":0}]
[null,null,null,null,"656G8004",0,"GRAFENTHAL CPU XEON E3-1270v6 3.80GHz 4C","8MB 72W"," ",null,null,{"$f":"Tabelle212172[[#This Row],[Menge\n     *)]]*-1","v":0}]
[null,null,null,null,"656G8006",0,"GRAFENTHAL CPU XEON E3-1280v6 3.90GHz 4C","8MB 72W"," ",null,null,{"$f":"Tabelle212172[[#This Row],[Menge\n     *)]]*-1","v":0}]
[null,null,null,null,"656G8012",0,"GRAFENTHAL CPU CORE i3-7100 3.90GHz 2C","3MB 51W INTEL HD GRAPHICS 630"," ",null,null,{"$f":"Tabelle212172[[#This Row],[Menge\n     *)]]*-1","v":0}]
[null,null,null,null,"656G8013",0,"GRAFENTHAL CPU CORE i3-7300 4.00GHz 2C","4MB 51W INTEL HD GRAPHICS 630"," ",null,null,{"$f":"Tabelle212172[[#This Row],[Menge\n     *)]]*-1","v":0}]
[null,null,null,null,"656G8014",0,"GRAFENTHAL CPU CORE i3-7320 4.10GHz 2C","4MB 51W INTEL HD GRAPHICS 630"," ",null,null,{"$f":"Tabelle212172[[#This Row],[Menge\n     *)]]*-1","v":0}]
[null,null,null,null,"656G8015",0,"GRAFENTHAL CPU CORE i3-7350K 4.20GHz 2C","4MB 60W INTEL HD GRAPHICS 630"," ",null,null,{"$f":"Tabelle212172[[#This Row],[Menge\n     *)]]*-1","v":0}]
[null,null,null,null,"656G8016",0,"GRAFENTHAL CPU CORE i5-7400 3.00GHz 4C","6MB 65W INTEL HD GRAPHICS 630"," ",null,null,{"$f":"Tabelle212172[[#This Row],[Menge\n     *)]]*-1","v":0}]
[null,null,null,null,"656G8017",0,"GRAFENTHAL CPU CORE i5-7500 3.40GHz 4C","6MB 65W INTEL HD GRAPHICS 630"," ",null,null,{"$f":"Tabelle212172[[#This Row],[Menge\n     *)]]*-1","v":0}]
[null,null,null,null,"656G8018",0,"GRAFENTHAL CPU CORE i5-7600 3.50GHz 4C","6MB 65W INTEL HD GRAPHICS 630"," ",null,null,{"$f":"Tabelle212172[[#This Row],[Menge\n     *)]]*-1","v":0}]
[null,null,null,null,"656G8019",0,"GRAFENTHAL CPU CORE i5-7600K 3.80GHz 4C","6MB 91W INTEL HD GRAPHICS 630"," ",null,null,{"$f":"Tabelle212172[[#This Row],[Menge\n     *)]]*-1","v":0}]
[null,null,null,null,"656G8020",0,"GRAFENTHAL CPU CORE i7-7700 3.60GHz 4C","6MB 65W INTEL HD GRAPHICS 630"," ",null,null,{"$f":"Tabelle212172[[#This Row],[Menge\n     *)]]*-1","v":0}]
[null,null,null,null,"656G8021",0,"GRAFENTHAL CPU CORE i7-7700 4.20GHz 4C","8MB 91W INTEL HD GRAPHICS 630"," ",null,null,{"$f":"Tabelle212172[[#This Row],[Menge\n     *)]]*-1","v":0}]
[null,null,null,null,"Arbeitsspeicher",{"$f":"SUM(F32:F33)","v":0},"* kombinierbar *"]
[null,null,null,null,"652G7004",0,"GRAFENTHAL MEM 8GB DDR4-2400MHz UDIMM","PC4-19200 CL17 DUAL RANKED ECC"," ",null,null,null,{"$f":"Tabelle212172[[#This Row],[Menge\n     *)]]*-1","v":0}]
[null,null,null,null,"652G7005",0,"GRAFENTHAL MEM 16GB DDR4-2400MHz UDIMM","PC4-19200 CL17 DUAL RANKED ECC"," ",null,null,null,{"$f":"Tabelle212172[[#This Row],[Menge\n     *)]]*-1","v":0}]
[null,null,null,null,"Raid Controller",{"$f":"SUM(F35:F39)","v":0}]
[null,null,null,null,"653G6002",0,"GRAFENTHAL CABLE 0,5M","SFF-8643 TO 4x S-ATA"," ",null,{"$f":"IF(AND(Tabelle212172[[#This Row],[Menge\n     *)]]<>1,COUNTIF($F$36:$F$37,\">0\")),-1,IF(AND(Tabelle212172[[#This Row],[Menge\n     *)]]<>2,COUNTIF($F$38:$F$39,\">0\")),-1,0))","v":0},null,null,null,null,null,null,null,null,null,null,null,null,{"$f":"Tabelle212172[[#This Row],[Menge\n     *)]]*4","v":0}]
[null,null,null,null,"653G5004",0,"GRAFENTHAL RAID CONTROLLER SAS/SATA","12Gb/s/6GB/s 4i 1GB CACHE PCIe 3.0 x8","RAID 0 1 5 6 10 50 60 TYP 9361-4I",null,null,null,null,null,{"$f":"Tabelle212172[[#This Row],[Menge\n     *)]]*-2","v":0},{"$f":"Tabelle212172[[#This Row],[Menge\n     *)]]*-1","v":0}]
[null,null,null,null,"653G7004",0,"GRAFENTHAL MEGARAID 9341-4i CONTROLLER","SATA 6GB/S SAS 12GB/S PCIe 3.0 x8","RAID 0 1 5 10 50 TYP 9341-4I",null,null,null,null,null,{"$f":"Tabelle212172[[#This Row],[Menge\n     *)]]*-2","v":0},{"$f":"Tabelle212172[[#This Row],[Menge\n     *)]]*-1","v":0}]
[null,null,null,null,"653G5007",0,"GRAFENTHAL RAID CONTROLLER SAS/SATA","12GB/S /6GB/S 8i 1GB CACHE","RAID 0 1  5 6 10 50 60 TYP 9361-8I",null,null,null,null,null,{"$f":"Tabelle212172[[#This Row],[Menge\n     *)]]*-2","v":0},{"$f":"Tabelle212172[[#This Row],[Menge\n     *)]]*-1","v":0}]
[null,null,null,null,"653G5008",0,"GRAFENTHAL RAID CONTROLLER SAS/SATA","12GB/S /6GB/S 8i NO CACHE"," ",null,null,null,null,null,{"$f":"Tabelle212172[[#This Row],[Menge\n     *)]]*-2","v":0},{"$f":"Tabelle212172[[#This Row],[Menge\n     *)]]*-1","v":0}]
[null,null,null,null,"Gehäusezubehör",{"$f":"SUM(F41:F41)","v":0}]
[null,null,null,null,"659G8011",0,"GRAFENTHAL EINBAURAHMEN 3,5'' AUF 2,5''"," "," ",null,null,null,null,null,null,null,null,null,{"$f":"Tabelle212172[[#This Row],[Menge\n     *)]]*-1","v":0},null,{"$f":"Tabelle212172[[#This Row],[Menge\n     *)]]*2","v":0}]
[null,null,null,null,"HDD / SSD * extern *",null," * keine externen slots *"]
[null,null,null,null,"HDD / SSD * intern NHS *",{"$f":"SUM(F44,F52,F54,F57,F62,F66)","v":0}," * in internen Slots *"]
[null,null,null,null,"HDD SATA 3,5\"",{"$f":"SUM(F45:F51)","v":0}]
[null,null,null,null,"651G8012",0,"GRAFENTHAL HDD 12TB SATA 3.5'' 7.2K","6GB/S MTBF 2.5M HOURS 5Y WARRANTY"," ",null,null,null,null,null,null,null,null,null,{"$f":"Tabelle212172[[#This Row],[Menge\n     *)]]*-1","v":0},null,null,null,null,{"$f":"Tabelle212172[[#This Row],[Menge\n     *)]]*-1","v":0},null,{"$f":"Tabelle212172[[#This Row],[Menge\n     *)]]*-1","v":0}]
[null,null,null,null,"651G8013",0,"GRAFENTHAL HDD 10TB SATA 3.5''","7.2K 6GB/S MTBF 2.5M HOURS 5Y WARRANTY"," ",null,null,null,null,null,null,null,null,null,{"$f":"Tabelle212172[[#This Row],[Menge\n     *)]]*-1","v":0},null,null,null,null,{"$f":"Tabelle212172[[#This Row],[Menge\n     *)]]*-1","v":0},null,{"$f":"Tabelle212172[[#This Row],[Menge\n     *)]]*-1","v":0}]
[null,null,null,null,"651G8014",0,"GRAFENTHAL HDD 8TB SATA 3.5''","7.2K 6GB/S MTBF 2.5M HOURS 5Y WARRANTY"," ",null,null,null,null,null,null,null,null,null,{"$f":"Tabelle212172[[#This Row],[Menge\n     *)]]*-1","v":0},null,null,null,null,{"$f":"Tabelle212172[[#This Row],[Menge\n     *)]]*-1","v":0},null,{"$f":"Tabelle212172[[#This Row],[Menge\n     *)]]*-1","v":0}]
[null,null,null,null,"651G8015",0,"GRAFENTHAL HDD 6TB SATA 3.5''","7.2K 6GB/S MTBF 2.5M HOURS 5Y WARRANTY"," ",null,null,null,null,null,null,null,null,null,{"$f":"Tabelle212172[[#This Row],[Menge\n     *)]]*-1","v":0},null,null,null,null,{"$f":"Tabelle212172[[#This Row],[Menge\n     *)]]*-1","v":0},null,{"$f":"Tabelle212172[[#This Row],[Menge\n     *)]]*-1","v":0}]
[null,null,null,null,"651G8016",0,"GRAFENTHAL HDD 4TB SATA 3.5''","7.2K 6GB/S MTBF 2.5M HOURS 5Y WARRANTY"," ",null,null,null,null,null,null,null,null,null,{"$f":"Tabelle212172[[#This Row],[Menge\n     *)]]*-1","v":0},null,null,null,null,{"$f":"Tabelle212172[[#This Row],[Menge\n     *)]]*-1","v":0},null,{"$f":"Tabelle212172[[#This Row],[Menge\n     *)]]*-1","v":0}]
[null,null,null,null,"651G8017",0,"GRAFENTHAL HDD 2TB SATA 3.5''","7.2K 6GB/S MTBF 2.5M HOURS 5Y WARRANTY"," ",null,null,null,null,null,null,null,null,null,{"$f":"Tabelle212172[[#This Row],[Menge\n     *)]]*-1","v":0},null,null,null,null,{"$f":"Tabelle212172[[#This Row],[Menge\n     *)]]*-1","v":0},null,{"$f":"Tabelle212172[[#This Row],[Menge\n     *)]]*-1","v":0}]
[null,null,null,null,"651G8018",0,"GRAFENTHAL HDD 1TB SATA 3.5''","7.2K 6GB/S MTBF 2.5M HOURS 5Y WARRANTY"," ",null,null,null,null,null,null,null,null,null,{"$f":"Tabelle212172[[#This Row],[Menge\n     *)]]*-1","v":0},null,null,null,null,{"$f":"Tabelle212172[[#This Row],[Menge\n     *)]]*-1","v":0},null,{"$f":"Tabelle212172[[#This Row],[Menge\n     *)]]*-1","v":0}]
[null,null,null,null,"HDD SATA 2,5\" 7.2k 6GB/s ",{"$f":"SUM(F53)","v":0}]
[null,null,null,null,"651G6002",0,"GRAFENTHAL HDD 1TB 2,5'' SATA 7200RPM","32MB CACHE 6GB/S BAUHÖHE 9.5MM","FUER SERVER UND WORKSTATION",null,null,null,null,null,null,null,null,null,null,null,{"$f":"Tabelle212172[[#This Row],[Menge\n     *)]]*-1","v":0},null,null,{"$f":"Tabelle212172[[#This Row],[Menge\n     *)]]*-1","v":0},null,{"$f":"Tabelle212172[[#This Row],[Menge\n     *)]]*-1","v":0}]
[null,null,null,null,"SSD SATA 2,5\" 6GB/s ",{"$f":"SUM(F55:F56)","v":0},"*MIDRANGE*"]
[null,null,null,null,"651G7011",0,"GRAFENTHAL SSD 240GB 2.5'' SATA 6GB/S","MIDRANGE 599 TBW"," ",null,null,null,null,null,null,null,null,null,null,null,{"$f":"Tabelle212172[[#This Row],[Menge\n     *)]]*-1","v":0},null,null,{"$f":"Tabelle212172[[#This Row],[Menge\n     *)]]*-1","v":0},null,{"$f":"Tabelle212172[[#This Row],[Menge\n     *)]]*-1","v":0}]
[null,null,null,null,"651G7012",0,"GRAFENTHAL SSD 480GB 2.5'' SATA 6GB/S","MIDRANGE 945 TBW"," ",null,null,null,null,null,null,null,null,null,null,null,{"$f":"Tabelle212172[[#This Row],[Menge\n     *)]]*-1","v":0},null,null,{"$f":"Tabelle212172[[#This Row],[Menge\n     *)]]*-1","v":0},null,{"$f":"Tabelle212172[[#This Row],[Menge\n     *)]]*-1","v":0}]
[null,null,null,null,"SSD SATA 2,5\" 6GB/s ",{"$f":"SUM(F58:F61)","v":0},"*ENTRY*"]
[null,null,null,null,"651G8024",0,"GRAFENTHAL SSD 256GB SATA3 6GB/S 2.5''","MTBF 1.5M HOURS TBW 300TB"," ",null,null,null,null,null,null,null,null,null,null,null,{"$f":"Tabelle212172[[#This Row],[Menge\n     *)]]*-1","v":0},null,null,{"$f":"Tabelle212172[[#This Row],[Menge\n     *)]]*-1","v":0},null,{"$f":"Tabelle212172[[#This Row],[Menge\n     *)]]*-1","v":0}]
[null,null,null,null,"651G8025",0,"GRAFENTHAL SSD 512GB SATA3 6GB/S 2.5''","MTBF 1.5M HOURS TBW 300TB"," ",null,null,null,null,null,null,null,null,null,null,null,{"$f":"Tabelle212172[[#This Row],[Menge\n     *)]]*-1","v":0},null,null,{"$f":"Tabelle212172[[#This Row],[Menge\n     *)]]*-1","v":0},null,{"$f":"Tabelle212172[[#This Row],[Menge\n     *)]]*-1","v":0}]
[null,null,null,null,"651G8026",0,"GRAFENTHAL SSD 1TB SATA3 6GB/S 2.5''","MTBF 1.5M HOURS TBW 300TB"," ",null,null,null,null,null,null,null,null,null,null,null,{"$f":"Tabelle212172[[#This Row],[Menge\n     *)]]*-1","v":0},null,null,{"$f":"Tabelle212172[[#This Row],[Menge\n     *)]]*-1","v":0},null,{"$f":"Tabelle212172[[#This Row],[Menge\n     *)]]*-1","v":0}]
[null,null,null,null,"651G8027",0,"GRAFENTHAL SSD 2TB SATA3 6GB/S 2.5''","MTBF 1.5M HOURS TBW 300TB"," ",null,null,null,null,null,null,null,null,null,null,null,{"$f":"Tabelle212172[[#This Row],[Menge\n     *)]]*-1","v":0},null,null,{"$f":"Tabelle212172[[#This Row],[Menge\n     *)]]*-1","v":0},null,{"$f":"Tabelle212172[[#This Row],[Menge\n     *)]]*-1","v":0}]
[null,null,null,null,"SSD M.2 SATA 6GB/s",{"$f":"SUM(F63:F65)","v":0},"* disables SATA port 1 *"]
[null,null,null,null,"651G8000",0,"GRAFENTHAL SSD 256GB M.2 2280 SATA 6GB/S","256BIT-AES MTBF 1.6M HOURS TBW 144TB"," ",null,null,null,null,null,null,null,null,null,null,null,null,{"$f":"Tabelle212172[[#This Row],[Menge\n     *)]]*-1","v":0},null,{"$f":"Tabelle212172[[#This Row],[Menge\n     *)]]*-1","v":0},null,{"$f":"Tabelle212172[[#This Row],[Menge\n     *)]]*-1","v":0},{"$f":"Tabelle212172[[#This Row],[Menge\n     *)]]*-1","v":0}]
[null,null,null,null,"651G8001",0,"GRAFENTHAL SSD 512GB M.2 2280 SATA 6GB/S","256BIT-AES MTBF 1.6M HOURS TBW 288TB"," ",null,null,null,null,null,null,null,null,null,null,null,null,{"$f":"Tabelle212172[[#This Row],[Menge\n     *)]]*-1","v":0},null,{"$f":"Tabelle212172[[#This Row],[Menge\n     *)]]*-1","v":0},null,{"$f":"Tabelle212172[[#This Row],[Menge\n     *)]]*-1","v":0},{"$f":"Tabelle212172[[#This Row],[Menge\n     *)]]*-1","v":0}]
[null,null,null,null,"651G8002",0,"GRAFENTHAL SSD 1TB M.2 2280 SATA 6GB/S","256BIT-AES TCG OPAL 2.0 MTBF 1.5M HOURS"," ",null,null,null,null,null,null,null,null,null,null,null,null,{"$f":"Tabelle212172[[#This Row],[Menge\n     *)]]*-1","v":0},null,{"$f":"Tabelle212172[[#This Row],[Menge\n     *)]]*-1","v":0},null,{"$f":"Tabelle212172[[#This Row],[Menge\n     *)]]*-1","v":0},{"$f":"Tabelle212172[[#This Row],[Menge\n     *)]]*-1","v":0}]
[null,null,null,null,"SSD M.2 NVMe",{"$f":"SUM(F67:F69)","v":0},"* disables PCI x16_2 *"]
[null,null,null,null,"651G7000",0,"GRAFENTHAL SSD 512GB NVME M.2","PCIe 3.0 x4 READ 3500MB/S WRITE 2100MB/S"," ",null,null,null,null,null,{"$f":"Tabelle212172[[#This Row],[Menge\n     *)]]*-2","v":0},{"$f":"Tabelle212172[[#This Row],[Menge\n     *)]]*-1","v":0},null,null,null,null,null,{"$f":"Tabelle212172[[#This Row],[Menge\n     *)]]*-1","v":0},null,null,null,null,null,{"$f":"Tabelle212172[[#This Row],[Menge\n     *)]]*-1","v":0}]
[null,null,null,null,"651G7001",0,"GRAFENTHAL SSD 1TB NVME M.2","PCIe 3.0 x4 READ 3500MB/S WRITE 2100MB/S"," ",null,null,null,null,null,{"$f":"Tabelle212172[[#This Row],[Menge\n     *)]]*-2","v":0},{"$f":"Tabelle212172[[#This Row],[Menge\n     *)]]*-1","v":0},null,null,null,null,null,{"$f":"Tabelle212172[[#This Row],[Menge\n     *)]]*-1","v":0},null,null,null,null,null,{"$f":"Tabelle212172[[#This Row],[Menge\n     *)]]*-1","v":0}]
[null,null,null,null,"651G7002",0,"GRAFENTHAL SSD 2TB NVME M.2","PCIe 3.0 x4 READ 3500MB/S WRITE 2100MB/S"," ",null,null,null,null,null,{"$f":"Tabelle212172[[#This Row],[Menge\n     *)]]*-2","v":0},{"$f":"Tabelle212172[[#This Row],[Menge\n     *)]]*-1","v":0},null,null,null,null,null,{"$f":"Tabelle212172[[#This Row],[Menge\n     *)]]*-1","v":0},null,null,null,null,null,{"$f":"Tabelle212172[[#This Row],[Menge\n     *)]]*-1","v":0}]
[null,null,null,null,"Grafikkarte * mindestens 1 x *",{"$f":"SUM(F71:F75)","v":0},"* maximal 1 x  *"]
[null,null,null,null,"659G8003",0,"GRAFENTHAL GPU NVIDIA QUADRO P400 256C","2GB GDDR5 32GB/S 30W PCI-E 3.0 x16"," ",null,null,null,null,null,null,null,null,{"$f":"Tabelle212172[[#This Row],[Menge\n     *)]]*-1","v":0}]
[null,null,null,null,"659G8004",0,"GRAFENTHAL GPU NVIDIA QUADRO P600 384C","2GB GDDR5 64GB/S 40W PCI-E 3.0 x16"," ",null,null,null,null,null,null,null,null,{"$f":"Tabelle212172[[#This Row],[Menge\n     *)]]*-1","v":0}]
[null,null,null,null,"659G8005",0,"GRAFENTHAL GPU NVIDIA QUADRO P1000 640C","4GB GDDR5 82GB/S 47W PCI-E 3.0 x16"," ",null,null,null,null,null,null,null,null,{"$f":"Tabelle212172[[#This Row],[Menge\n     *)]]*-1","v":0}]
[null,null,null,null,"659G8006",0,"GRAFENTHAL GPU NVIDIA QUADRO P2000 1024C","5GB GDDR5 140GB/S 75W PCI-E 3.0 x16"," ",null,null,null,null,null,null,null,null,{"$f":"Tabelle212172[[#This Row],[Menge\n     *)]]*-1","v":0}]
[null,null,null,null,"659G8007",0,"GRAFENTHAL GPU NVIDIA QUADRO P4000 1792C","8GB GDDR5 243GB/S 105W PCI-E 3.0 x16"," ",null,null,null,null,null,null,null,null,{"$f":"Tabelle212172[[#This Row],[Menge\n     *)]]*-1","v":0}]
[null,null,null,null,"(Kupfer-) Netzkarte",{"$f":"SUM(F77:F78)","v":0},"* PCIe x16_2 supports max x4 *"]
[null,null,null,null,"653G7002",0,"GRAFENTHAL ETHERNET ADAPTER DUAL PORT","RJ45 2x10GBE X550-T2 PCIe 3.0 x4"," ",null,null,null,null,null,{"$f":"Tabelle212172[[#This Row],[Menge\n     *)]]*-2","v":0},{"$f":"Tabelle212172[[#This Row],[Menge\n     *)]]*-1","v":0}]
[null,null,null,null,"659G8015",0,"GRAFENTHAL GIGABIT ETHERNET APDATER","I350-T4V2 4x RJ-45 PCIe x4 COPPER"," ",null,null,null,null,null,{"$f":"Tabelle212172[[#This Row],[Menge\n     *)]]*-2","v":0},{"$f":"Tabelle212172[[#This Row],[Menge\n     *)]]*-1","v":0}]
[null,null,null,null,"(SFP+)Netzwerkkarte",{"$f":"SUM(F80)","v":0},"* PCIe x16_2 supports max x4 *"]
[null,null,null,null,"653G7003",0,"GRAFENTHAL ETHERNET ADAPTER 2-PORT 10GBE","INTEL X520 FIBRE SFP+ PCIe x8 LP"," ",null,null,null,null,null,{"$f":"Tabelle212172[[#This Row],[Menge\n     *)]]*-2","v":0},{"$f":"Tabelle212172[[#This Row],[Menge\n     *)]]*-1","v":0}]
[null,null,null,null,"Glasfaserkarte HBA",{"$f":"SUM(F82:F83)","v":0},"* PCIe x16_2 supports max x4 *"]
[null,null,null,null,"659G7000",0,"GRAFENTHAL QLOGIC HBA FC SINGLE PORT","16GB/S PCIe 3.0 x8"," ",null,null,null,null,null,{"$f":"Tabelle212172[[#This Row],[Menge\n     *)]]*-2","v":0},{"$f":"Tabelle212172[[#This Row],[Menge\n     *)]]*-1","v":0}]
[null,null,null,null,"659G7001",0,"GRAFENTHAL QLOGIC HBA FC DUAL PORT","16GB/S PCIe 3.0 x8"," ",null,null,null,null,null,{"$f":"Tabelle212172[[#This Row],[Menge\n     *)]]*-2","v":0},{"$f":"Tabelle212172[[#This Row],[Menge\n     *)]]*-1","v":0}]
[null,null,null,null,"CONFIG-TO-ORDER",{"$f":"SUM(F85:F88)","v":0}]
[null,null,null,null,"CTO",0,"HARDWARE ASSEMBLIERUNG"]
[null,null,null,null,"CTO1",0,"HARDWARE ASSEMBLIERUNG & FIRMWARE UPDATE"]
[null,null,null,null,"CTO2",0,"HARDWARE ASSEMBLIERUNG, FIRMWARE UPDATE & RAID EINRICHTUNG"]
[null,null,null,null,"CTO3",0,"HARDWARE ASSEMBLIERUNG, FIRMWARE UPDATE, RAID EINRICHTUNG & OS INSTALLATION"]
[null,null,null,null,"USB Drive",{"$f":"SUM(F90)","v":0}]
[null,null,null,null,"652G6004",0,"GRAFENTHAL USB 3.0 FLASH DRIVE","ULTRA FIT 64GB UP TO 150MB/S"," "]
[null,null,null,null,"USV- Systeme",{"$f":"SUM(F92:F95)","v":0}]
[null,null,null,null,"132G0150",0,"GRAFENTHAL USV ETR-1500 TOWER RACK LINE","INTERACTIVE 1500VA 1200W PURE SINEWAVE","ECO MODE 23KG CE ROHS GERMAN"]
[null,null,null,null,"132G0300",0,"GRAFENTHAL USV ETR-3000 TOWER RACK LINE","INTERACTIVE 3000VA 2400W PURE SINEWAVE","ECO MODE 35KG CE ROHS GERMAN"]
[null,null,null,null,"113G1150",0,"GRAFENTHAL USV PR-1500-HS PROGRAMMABLE","ECO MODE RACK MOUNT 2U USB RS232 LCD"," "]
[null,null,null,null,"113G1300",0,"GRAFENTHAL USV PR-3000-HS ONLINE","ECO MODE RACK MOUNT 2U USB RS232 LCD"," "]
[null,null,null,null,"USV- Zubehör",{"$f":"SUM(F97:F98)","v":0}]
[null,null,null,null,"149G6005",0,"GRAFENTHAL USV SNMP CARD PRO S2","FOR ETR AND PR AND PTR SERIES","MULTI SERVER SHUTDOWN"]
[null,null,null,null,"149G5003",0,"GRAFENTHAL USV ACCESSORY LICENSE FOR","SNMP PRO CARD FOR ETR AND PR SERIES","MULTI SERVER SHUTDOWN"]
[null,null,null,null,"SUMME",1,null,null,null,{"$f":"COUNTIF($J$100:$AH$100,\"<0\")","v":0}]
[null,null,null,null,null,null,null,null,null,{"$f":"SUM(J14:J98)","v":0},0,0,0,0,0,0,0,0,0,0,0,0,0,0,0,0,0,{"$f":"SUM(AB14:AB98)","v":0},0,0,0,0,0,0]

{"sheet":"W2904 S2","index":13,"n_rows":162,"n_cols":25,"rows_kept":162,"cut":false,"hidden":false,"merged":[[0,4,0,8]]}
[null,null,null,null,"Workstation W2904 S2"]
[]
[null,null,null,null,null,null,null,"Intel® Xeon® E5-2600 v4 Produktfamilie mit bis zu 22 Kernen ","more Info"]
[null,null,null,null,null,null,null,"Netzteil 1200W 80PLUS Platinum "]
[null,null,null,null,null,null,null,"bis zu 1.024 GB DDR4-Speicher "]
[null,null,null,null,null,null,null,"bis zu 4  hot-plug-fähige HDD / SSD "]
[null,null,null,null,null,null,null,"1 x M.2 Port NGFF 22110/2280/2260 ","* Felder werden automatisch ausgefüllt"]
[null,null,null,null,null,null,null,null,"*) \"Menge\" filtern um Konfiguration anzuzeigen"]
[]
[]
[null,null,null,null,"Konfigurator",null,{"$f":"'Revision Info'!B10","v":"Revision 15"},null,null,null,null,null,null,null,null,null,null,"extern"]
[null,null,null,null,"ART. NR.","Menge\n    *)","Bezeichnung","Bezeichnung II","Bezeichnung III","nicht kombinierbar","nicht konfigurierbar","CPU slots","MEM Slots","PCI x1 Slots","PCI x4 Slots","PCI x8 Slots","PCI x16 Slots","HD Slots HS \n2.5\" /3,5\"","Hdd ports SATA\n2,5\" / 3,5\"","HDD ports SAS\n2,5\" / 3,5\"","NVME Slot","CacheCade\nDongle","Cache Vault\n Flash Cache","DVD Slot\n5,25\" SATA","PSU Slot\nbase"]
[null,null,null,null,"Maschinentyp",{"$f":"SUM(F14)","v":0},null,null,null,"if (Kombi);-1;0","if Menge;-1;0","(Menge x Eigenschaft)","(Menge x Eigenschaft)","(Menge x Eigenschaft)","(Menge x Eigenschaft)","(Menge x Eigenschaft)","(Menge x Eigenschaft)","(Menge x Eigenschaft)","(Menge x Eigenschaft)","(Menge x Eigenschaft)","(Menge x Eigenschaft)","(Menge x Eigenschaft)","(Menge x Eigenschaft)","(Menge x Eigenschaft)","(Menge x Eigenschaft)"]
[null,null,null,null,"722G8001",0,"GRAFENTHAL CTO WORKSTATION W2904 S2","2 SOCKET SYSTEM INTEL E5-2600 V4 TYPE","TOWER 4 HDD SSD SLOTS SINGLE PSU","X","X",{"$f":"Tabelle491016[[#This Row],[Menge\n    *)]]*2","v":0},{"$f":"Tabelle491016[[#This Row],[Menge\n    *)]]*0","v":0},{"$f":"Tabelle491016[[#This Row],[Menge\n    *)]]*6","v":0},{"$f":"Tabelle491016[[#This Row],[Menge\n    *)]]*6","v":0},{"$f":"Tabelle491016[[#This Row],[Menge\n    *)]]*6","v":0},{"$f":"Tabelle491016[[#This Row],[Menge\n    *)]]*4","v":0},{"$f":"Tabelle491016[[#This Row],[Menge\n    *)]]*4","v":0},{"$f":"Tabelle491016[[#This Row],[Menge\n    *)]]*10","v":0},{"$f":"Tabelle491016[[#This Row],[Menge\n    *)]]*0","v":0},{"$f":"Tabelle491016[[#This Row],[Menge\n    *)]]*1","v":0},{"$f":"Tabelle491016[[#This Row],[Menge\n    *)]]*0","v":0},{"$f":"Tabelle491016[[#This Row],[Menge\n    *)]]*0","v":0},{"$f":"Tabelle491016[[#This Row],[Menge\n    *)]]*1","v":0},{"$f":"Tabelle491016[[#This Row],[Menge\n    *)]]*1","v":0}]
[null,null,null,null,"Prozessor"]
[null,null,null,null,"V4 Prozessoren",{"$f":"SUM(F17:F28)","v":0}]
[null,null,null,null,"656G6016",0,"GRAFENTHAL CPU XEON E5-2637 V4 4CORE","3,5Ghz LGA2011V3 15MB CACHE 8 THREADS"," ",{"$f":"IF(COUNTIF($F$17:$F$28,\">0\")>1,-1,0)","v":0},"X",{"$f":"Tabelle491016[[#This Row],[Menge\n    *)]]*-1","v":0},{"$f":"Tabelle491016[[#This Row],[Menge\n    *)]]*8","v":0},"X","X","X","X","X","X","X","X","X","X","X","X"]
[null,null,null,null,"656G6017",0,"GRAFENTHAL CPU XEON E5-2603 V4 6CORE","1,7Ghz LGA2011V3 15MB CACHE 6 THREADS"," ","X","X",{"$f":"Tabelle491016[[#This Row],[Menge\n    *)]]*-1","v":0},{"$f":"Tabelle491016[[#This Row],[Menge\n    *)]]*8","v":0},"X","X","X","X","X","X","X","X","X","X","X","X"]
[null,null,null,null,"656G6018",0,"GRAFENTHAL CPU XEON E5-2609 V4 8CORE","1,7Ghz LGA2011V3 20MB CACHE 8 THREADS"," ","X","X",{"$f":"Tabelle491016[[#This Row],[Menge\n    *)]]*-1","v":0},{"$f":"Tabelle491016[[#This Row],[Menge\n    *)]]*8","v":0},"X","X","X","X","X","X","X","X","X","X","X","X"]
[null,null,null,null,"656G6019",0,"GRAFENTHAL CPU XEON E5-2620 V4 8CORE","2,1GHz LGA2011V3 20MB CACHE 16 THREADS"," ","X","X",{"$f":"Tabelle491016[[#This Row],[Menge\n    *)]]*-1","v":0},{"$f":"Tabelle491016[[#This Row],[Menge\n    *)]]*8","v":0},"X","X","X","X","X","X","X","X","X","X","X","X"]
[null,null,null,null,"656G6020",0,"GRAFENTHAL CPU XEON E5-2630v4 2.20GHz","10C 25MB 85W"," ","X","X",{"$f":"Tabelle491016[[#This Row],[Menge\n    *)]]*-1","v":0},{"$f":"Tabelle491016[[#This Row],[Menge\n    *)]]*8","v":0},"X","X","X","X","X","X","X","X","X","X","X","X"]
[null,null,null,null,"656G6021",0,"GRAFENTHAL CPU XEON E5-2640 V4 10CORE","2,4Ghz LGA2011V3 25MB CACHE 20 THREADS"," ","X","X",{"$f":"Tabelle491016[[#This Row],[Menge\n    *)]]*-1","v":0},{"$f":"Tabelle491016[[#This Row],[Menge\n    *)]]*8","v":0},"X","X","X","X","X","X","X","X","X","X","X","X"]
[null,null,null,null,"656G6022",0,"GRAFENTHAL CPU XEON E5-2650 V4 12CORE","2,2Ghz LGA2011V3 30MB CACHE 24 THREADS"," ","X","X",{"$f":"Tabelle491016[[#This Row],[Menge\n    *)]]*-1","v":0},{"$f":"Tabelle491016[[#This Row],[Menge\n    *)]]*8","v":0},"X","X","X","X","X","X","X","X","X","X","X","X"]
[null,null,null,null,"656G6023",0,"GRAFENTHAL CPU XEON E5-2660 V4 14CORE","2,0Ghz LGA2011V3 35MB CACHE 28 THREADS"," ","X","X",{"$f":"Tabelle491016[[#This Row],[Menge\n    *)]]*-1","v":0},{"$f":"Tabelle491016[[#This Row],[Menge\n    *)]]*8","v":0},"X","X","X","X","X","X","X","X","X","X","X","X"]
[null,null,null,null,"656G6024",0,"GRAFENTHAL CPU XEON E5-2680 V4 14CORE","2,40GHz LGA2011 35MB CACHE 28 THREADS"," ","X","X",{"$f":"Tabelle491016[[#This Row],[Menge\n    *)]]*-1","v":0},{"$f":"Tabelle491016[[#This Row],[Menge\n    *)]]*8","v":0},"X","X","X","X","X","X","X","X","X","X","X","X"]
[null,null,null,null,"656G6025",0,"GRAFENTHAL CPU XEON E5-2690 V4 14CORE","2,6Ghz LGA2011V3 35MB CACHE 28 THREADS"," ","X","X",{"$f":"Tabelle491016[[#This Row],[Menge\n    *)]]*-1","v":0},{"$f":"Tabelle491016[[#This Row],[Menge\n    *)]]*8","v":0},"X","X","X","X","X","X","X","X","X","X","X","X"]
[null,null,null,null,"656G6026",0,"GRAFENTHAL CPU XEON E5-2687W V4 12CORE","3.00GHz LGA2011 30MB CACHE 24 THREADS"," ","X","X",{"$f":"Tabelle491016[[#This Row],[Menge\n    *)]]*-1","v":0},{"$f":"Tabelle491016[[#This Row],[Menge\n    *)]]*8","v":0},"X","X","X","X","X","X","X","X","X","X","X","X"]
[null,null,null,null,"656G7000",0,"GRAFENTHAL CPU XEON E5-2623v4 2.60GHz 4C","10MB 85W"," ","X","X",{"$f":"Tabelle491016[[#This Row],[Menge\n    *)]]*-1","v":0},{"$f":"Tabelle491016[[#This Row],[Menge\n    *)]]*8","v":0},"X","X","X","X","X","X","X","X","X","X","X","X"]
[null,null,null,null,"Heatsink",null,"2 HS sind base"]
[null,null,null,null,"Arbeitsspeicher",{"$f":"SUM(F31:F32)","v":0}]
[null,null,null,null,"652G7001",0,"GRAFENTHAL MEM 16GB DDR4 2400MHz LRDIMM","PC4-19200L CL17 DUAL RANKED ECC"," ",null,null,null,{"$f":"Tabelle491016[[#This Row],[Menge\n    *)]]*-1","v":0}]
[null,null,null,null,"652G7002",0,"GRAFENTHAL MEM 32GB DDR4 2400MHz LRDIMM","PC4-19200L CL17 DUAL RANKED ECC"," ",null,null,null,{"$f":"Tabelle491016[[#This Row],[Menge\n    *)]]*-1","v":0}]
[null,null,null,null,"Festplatten",{"$f":"SUM(F34,F37,F42,F50,F52,F58,F65,F69,F74,F78)","v":0},""]
[null,null,null,null,"SATA SSD 6GB/s *MIDRANGE*",{"$f":"SUM(F35:F36)","v":0}]
[null,null,null,null,"651G7011",0,"GRAFENTHAL SSD 240GB 2.5'' SATA 6GB/S","MIDRANGE 599 TBW"," ","X","X","X","X","X","X","X","X",{"$f":"Tabelle491016[[#This Row],[Menge\n    *)]]*-1","v":0},{"$f":"Tabelle491016[[#This Row],[Menge\n    *)]]*-1","v":0},"X","X","X","X","X","X"]
[null,null,null,null,"651G7012",0,"GRAFENTHAL SSD 480GB 2.5'' SATA 6GB/S","MIDRANGE 945 TBW"," ","X","X","X","X","X","X","X","X",{"$f":"Tabelle491016[[#This Row],[Menge\n    *)]]*-1","v":0},{"$f":"Tabelle491016[[#This Row],[Menge\n    *)]]*-1","v":0},"X","X","X","X","X","X"]
[null,null,null,null,"SATA SSD 6GB/s *ENTRY*",{"$f":"SUM(F38:F41)","v":0}]
[null,null,null,null,"651G8024",0,"GRAFENTHAL SSD 256GB SATA3 6GB/S 2.5''","MTBF 1.5M HOURS TBW 300TB"," ",null,null,null,null,null,null,null,null,{"$f":"Tabelle491016[[#This Row],[Menge\n    *)]]*-1","v":0},{"$f":"Tabelle491016[[#This Row],[Menge\n    *)]]*-1","v":0},"X","X"]
[null,null,null,null,"651G8025",0,"GRAFENTHAL SSD 512GB SATA3 6GB/S 2.5''","MTBF 1.5M HOURS TBW 300TB"," ","X","X","X","X","X","X","X","X",{"$f":"Tabelle491016[[#This Row],[Menge\n    *)]]*-1","v":0},{"$f":"Tabelle491016[[#This Row],[Menge\n    *)]]*-1","v":0},"X","X","X","X","X","X"]
[null,null,null,null,"651G8026",0,"GRAFENTHAL SSD 1TB SATA3 6GB/S 2.5''","MTBF 1.5M HOURS TBW 300TB"," ","X","X","X","X","X","X","X","X",{"$f":"Tabelle491016[[#This Row],[Menge\n    *)]]*-1","v":0},{"$f":"Tabelle491016[[#This Row],[Menge\n    *)]]*-1","v":0},"X","X","X","X","X","X"]
[null,null,null,null,"651G8027",0,"GRAFENTHAL SSD 2TB SATA3 6GB/S 2.5''","MTBF 1.5M HOURS TBW 300TB"," ","X","X","X","X","X","X","X","X",{"$f":"Tabelle491016[[#This Row],[Menge\n    *)]]*-1","v":0},{"$f":"Tabelle491016[[#This Row],[Menge\n    *)]]*-1","v":0},"X","X","X","X","X","X"]
[null,null,null,null,"SATA 3,5\" 7,2k HDD 6GB/s",{"$f":"SUM(F43:F49)","v":0}]
[null,null,null,null,"651G8012",0,"GRAFENTHAL HDD 12TB SATA 3.5'' 7.2K","6GB/S MTBF 2.5M HOURS 5Y WARRANTY"," ","X","X","X","X","X","X","X","X",{"$f":"Tabelle491016[[#This Row],[Menge\n    *)]]*-1","v":0},{"$f":"Tabelle491016[[#This Row],[Menge\n    *)]]*-1","v":0},"X","X","X","X","X","X"]
[null,null,null,null,"651G8013",0,"GRAFENTHAL HDD 10TB SATA 3.5''","7.2K 6GB/S MTBF 2.5M HOURS 5Y WARRANTY"," ","X","X","X","X","X","X","X","X",{"$f":"Tabelle491016[[#This Row],[Menge\n    *)]]*-1","v":0},{"$f":"Tabelle491016[[#This Row],[Menge\n    *)]]*-1","v":0},"X","X","X","X","X","X"]
[null,null,null,null,"651G8014",0,"GRAFENTHAL HDD 8TB SATA 3.5''","7.2K 6GB/S MTBF 2.5M HOURS 5Y WARRANTY"," ","X","X","X","X","X","X","X","X",{"$f":"Tabelle491016[[#This Row],[Menge\n    *)]]*-1","v":0},{"$f":"Tabelle491016[[#This Row],[Menge\n    *)]]*-1","v":0},"X","X","X","X","X","X"]
[null,null,null,null,"651G8015",0,"GRAFENTHAL HDD 6TB SATA 3.5''","7.2K 6GB/S MTBF 2.5M HOURS 5Y WARRANTY"," ","X","X","X","X","X","X","X","X",{"$f":"Tabelle491016[[#This Row],[Menge\n    *)]]*-1","v":0},{"$f":"Tabelle491016[[#This Row],[Menge\n    *)]]*-1","v":0},"X","X","X","X","X","X"]
[null,null,null,null,"651G8016",0,"GRAFENTHAL HDD 4TB SATA 3.5''","7.2K 6GB/S MTBF 2.5M HOURS 5Y WARRANTY"," ","X","X","X","X","X","X","X","X",{"$f":"Tabelle491016[[#This Row],[Menge\n    *)]]*-1","v":0},{"$f":"Tabelle491016[[#This Row],[Menge\n    *)]]*-1","v":0},"X","X","X","X","X","X"]
[null,null,null,null,"651G8017",0,"GRAFENTHAL HDD 2TB SATA 3.5''","7.2K 6GB/S MTBF 2.5M HOURS 5Y WARRANTY"," ","X","X","X","X","X","X","X","X",{"$f":"Tabelle491016[[#This Row],[Menge\n    *)]]*-1","v":0},{"$f":"Tabelle491016[[#This Row],[Menge\n    *)]]*-1","v":0},"X","X","X","X","X","X"]
[null,null,null,null,"651G8018",0,"GRAFENTHAL HDD 1TB SATA 3.5''","7.2K 6GB/S MTBF 2.5M HOURS 5Y WARRANTY"," ","X","X","X","X","X","X","X","X",{"$f":"Tabelle491016[[#This Row],[Menge\n    *)]]*-1","v":0},{"$f":"Tabelle491016[[#This Row],[Menge\n    *)]]*-1","v":0},"X","X","X","X","X","X"]
[null,null,null,null,"SATA 2,5\" 7.2k HDD 6GB/s",{"$f":"SUM(F51)","v":0}]
[null,null,null,null,"651G6002",0,"GRAFENTHAL HDD 1TB 2,5'' SATA 7200RPM","32MB CACHE 6GB/S BAUHÖHE 9.5MM","FUER SERVER UND WORKSTATION","X","X","X","X","X","X","X","X",{"$f":"Tabelle491016[[#This Row],[Menge\n    *)]]*-1","v":0},{"$f":"Tabelle491016[[#This Row],[Menge\n    *)]]*-1","v":0},"X","X","X","X","X","X"]
[null,null,null,null,"SAS 3,5\" 7.2k HDD 12GB/s",{"$f":"SUM(F53:F57)","v":0}]
[null,null,null,null,"651G6016",0,"HDD 10TB SAS 7,2K 3,5“ 12GB/S 24/7","FOR GRAFENTHAL SERVER","MTTF 2.5M HOURS","X","X","X","X","X","X","X","X",{"$f":"Tabelle491016[[#This Row],[Menge\n    *)]]*-1","v":0},"X",{"$f":"Tabelle491016[[#This Row],[Menge\n    *)]]*-1","v":0},"X","X","X","X","X"]
[null,null,null,null,"651G6018",0,"HDD 8TB SAS 7,2K 3,5“ 12GB/S 24/7","FOR GRAFENTHAL SERVER","MTTF 2.5M HOURS","X","X","X","X","X","X","X","X",{"$f":"Tabelle491016[[#This Row],[Menge\n    *)]]*-1","v":0},"X",{"$f":"Tabelle491016[[#This Row],[Menge\n    *)]]*-1","v":0},"X","X","X","X","X"]
[null,null,null,null,"651G6019",0,"HDD 6TB SAS 7,2K 3,5“ 12GB/S 24/7","FOR GRAFENTHAL SERVER","MTTF 2.5M HOURS","X","X","X","X","X","X","X","X",{"$f":"Tabelle491016[[#This Row],[Menge\n    *)]]*-1","v":0},"X",{"$f":"Tabelle491016[[#This Row],[Menge\n    *)]]*-1","v":0},"X","X","X","X","X"]
[null,null,null,null,"651G6020",0,"GRAFENTHAL HDD 4TB SAS 7,2K 3,5“ 12GB/S","24/7","MTTF 2.5M HOURS","X","X","X","X","X","X","X","X",{"$f":"Tabelle491016[[#This Row],[Menge\n    *)]]*-1","v":0},"X",{"$f":"Tabelle491016[[#This Row],[Menge\n    *)]]*-1","v":0},"X","X","X","X","X"]
[null,null,null,null,"651G6021",0,"HDD 2TB SAS 7,2K 3,5“ 12GB/S 24/7","FOR GRAFENTHAL SERVER","MTTF 2.5M HOURS","X","X","X","X","X","X","X","X",{"$f":"Tabelle491016[[#This Row],[Menge\n    *)]]*-1","v":0},"X",{"$f":"Tabelle491016[[#This Row],[Menge\n    *)]]*-1","v":0},"X","X","X","X","X"]
[null,null,null,null,"SAS 2,5\" 10k 12GB/s",{"$f":"SUM(F59:F64)","v":0}]
[null,null,null,null,"651G8020",0,"GRAFENTHAL HDD 300GB 10K 2.5'' SAS","12GB/S"," ","X","X","X","X","X","X","X","X",{"$f":"Tabelle491016[[#This Row],[Menge\n    *)]]*-1","v":0},"X",{"$f":"Tabelle491016[[#This Row],[Menge\n    *)]]*-1","v":0},"X","X","X","X","X"]
[null,null,null,null,"651G8005",0,"GRAFENTHAL HDD 600GB 10K 2.5\\ SAS 12GB/S\""," "," ","X","X","X","X","X","X","X","X",{"$f":"Tabelle491016[[#This Row],[Menge\n    *)]]*-1","v":0},"X",{"$f":"Tabelle491016[[#This Row],[Menge\n    *)]]*-1","v":0},"X","X","X","X","X"]
[null,null,null,null,"651G8006",0,"GRAFENTHAL HDD 900GB 10K 2.5\\ SAS 12GB/S\""," "," ","X","X","X","X","X","X","X","X",{"$f":"Tabelle491016[[#This Row],[Menge\n    *)]]*-1","v":0},"X",{"$f":"Tabelle491016[[#This Row],[Menge\n    *)]]*-1","v":0},"X","X","X","X","X"]
[null,null,null,null,"651G8007",0,"GRAFENTHAL HDD 1.2TB 10K 2.5\\ SAS 12GB/S\""," "," ","X","X","X","X","X","X","X","X",{"$f":"Tabelle491016[[#This Row],[Menge\n    *)]]*-1","v":0},"X",{"$f":"Tabelle491016[[#This Row],[Menge\n    *)]]*-1","v":0},"X","X","X","X","X"]
[null,null,null,null,"651G8021",0,"GRAFENTHAL HDD 1.8TB 10K 2.5'' SAS","12GB/S"," ","X","X","X","X","X","X","X","X",{"$f":"Tabelle491016[[#This Row],[Menge\n    *)]]*-1","v":0},"X",{"$f":"Tabelle491016[[#This Row],[Menge\n    *)]]*-1","v":0},"X","X","X","X","X"]
[null,null,null,null,"651G8022",0,"GRAFENTHAL HDD 2.4TB 10K 2.5'' SAS","12GB/S"," ","X","X","X","X","X","X","X","X",{"$f":"Tabelle491016[[#This Row],[Menge\n    *)]]*-1","v":0},"X",{"$f":"Tabelle491016[[#This Row],[Menge\n    *)]]*-1","v":0},"X","X","X","X","X"]
[null,null,null,null,"SAS 2,5\" 15k 12GB/s",{"$f":"SUM(F66:F68)","v":0}]
[null,null,null,null,"651G8003",0,"GRAFENTHAL HDD 300GB 15K 2.5\\ SAS 12GB/S\""," "," ","X","X","X","X","X","X","X","X",{"$f":"Tabelle491016[[#This Row],[Menge\n    *)]]*-1","v":0},"X",{"$f":"Tabelle491016[[#This Row],[Menge\n    *)]]*-1","v":0},"X","X","X","X","X"]
[null,null,null,null,"651G8004",0,"GRAFENTHAL HDD 600GB 15K 2.5\\ SAS 12GB/S\""," "," ","X","X","X","X","X","X","X","X",{"$f":"Tabelle491016[[#This Row],[Menge\n    *)]]*-1","v":0},"X",{"$f":"Tabelle491016[[#This Row],[Menge\n    *)]]*-1","v":0},"X","X","X","X","X"]
[null,null,null,null,"651G8019",0,"GRAFENTHAL HDD 900GB 15K 2.5'' SAS","12GB/S"," ","X","X","X","X","X","X","X","X",{"$f":"Tabelle491016[[#This Row],[Menge\n    *)]]*-1","v":0},"X",{"$f":"Tabelle491016[[#This Row],[Menge\n    *)]]*-1","v":0},"X","X","X","X","X"]
[null,null,null,null,"SAS SSD  12GB/s *MIDRANGE*",{"$f":"SUM(F70:F73)","v":0}]
[null,null,null,null,"651G7004",0,"GRAFENTHAL SSD 480GB 2,5'' SAS 12GB/S","MIDRANGE DWPD 1"," ","X","X","X","X","X","X","X","X",{"$f":"Tabelle491016[[#This Row],[Menge\n    *)]]*-1","v":0},"X",{"$f":"Tabelle491016[[#This Row],[Menge\n    *)]]*-1","v":0},"X","X","X","X","X"]
[null,null,null,null,"651G7005",0,"GRAFENTHAL SSD 960GB 2,5'' SAS 12GB/S","MIDRANGE DWPD 1"," ","X","X","X","X","X","X","X","X",{"$f":"Tabelle491016[[#This Row],[Menge\n    *)]]*-1","v":0},"X",{"$f":"Tabelle491016[[#This Row],[Menge\n    *)]]*-1","v":0},"X","X","X","X","X"]
[null,null,null,null,"651G7006",0,"GRAFENTHAL SSD 1920GB 2,5'' SAS 12GB/S","MIDRANGE DWPD 1"," ","X","X","X","X","X","X","X","X",{"$f":"Tabelle491016[[#This Row],[Menge\n    *)]]*-1","v":0},"X",{"$f":"Tabelle491016[[#This Row],[Menge\n    *)]]*-1","v":0},"X","X","X","X","X"]
[null,null,null,null,"651G7007",0,"GRAFENTHAL SSD 3840GB 2,5'' SAS 12GB/S","MIDRANGE DWPD 1"," ","X","X","X","X","X","X","X","X",{"$f":"Tabelle491016[[#This Row],[Menge\n    *)]]*-1","v":0},"X",{"$f":"Tabelle491016[[#This Row],[Menge\n    *)]]*-1","v":0},"X","X","X","X","X"]
[null,null,null,null,"SSD M.2 SATA",{"$f":"SUM(F75:F77)","v":0}]
[null,null,null,null,"651G8000",0,"GRAFENTHAL SSD 256GB M.2 2280 SATA 6GB/S","256BIT-AES MTBF 1.6M HOURS TBW 144TB"," ",null,null,null,null,null,{"$f":"Tabelle491016[[#This Row],[Menge\n    *)]]*-1","v":0},null,null,null,{"$f":"Tabelle491016[[#This Row],[Menge\n    *)]]*-1","v":0},null,{"$f":"Tabelle491016[[#This Row],[Menge\n    *)]]*-1","v":0}]
[null,null,null,null,"651G8001",0,"GRAFENTHAL SSD 512GB M.2 2280 SATA 6GB/S","256BIT-AES MTBF 1.6M HOURS TBW 288TB"," ",null,null,null,null,null,{"$f":"Tabelle491016[[#This Row],[Menge\n    *)]]*-1","v":0},null,null,null,{"$f":"Tabelle491016[[#This Row],[Menge\n    *)]]*-1","v":0},null,{"$f":"Tabelle491016[[#This Row],[Menge\n    *)]]*-1","v":0}]
[null,null,null,null,"651G8002",0,"GRAFENTHAL SSD 1TB M.2 2280 SATA 6GB/S","256BIT-AES TCG OPAL 2.0 MTBF 1.5M HOURS"," ",null,null,null,null,null,{"$f":"Tabelle491016[[#This Row],[Menge\n    *)]]*-1","v":0},null,null,null,{"$f":"Tabelle491016[[#This Row],[Menge\n    *)]]*-1","v":0},null,{"$f":"Tabelle491016[[#This Row],[Menge\n    *)]]*-1","v":0}]
[null,null,null,null,"SSD M.2 NVMe",{"$f":"SUM(F79:F81)","v":0}]
[null,null,null,null,"651G7000",0,"GRAFENTHAL SSD 512GB NVME M.2","PCIe 3.0 x4 READ 3500MB/S WRITE 2100MB/S"," ",null,null,null,null,null,{"$f":"Tabelle491016[[#This Row],[Menge\n    *)]]*-1","v":0},null,null,null,{"$f":"Tabelle491016[[#This Row],[Menge\n    *)]]*-1","v":0},null,{"$f":"Tabelle491016[[#This Row],[Menge\n    *)]]*-1","v":0}]
[null,null,null,null,"651G7001",0,"GRAFENTHAL SSD 1TB NVME M.2","PCIe 3.0 x4 READ 3500MB/S WRITE 2100MB/S"," ",null,null,null,null,null,{"$f":"Tabelle491016[[#This Row],[Menge\n    *)]]*-1","v":0},null,null,null,{"$f":"Tabelle491016[[#This Row],[Menge\n    *)]]*-1","v":0},null,{"$f":"Tabelle491016[[#This Row],[Menge\n    *)]]*-1","v":0}]
[null,null,null,null,"651G7002",0,"GRAFENTHAL SSD 2TB NVME M.2","PCIe 3.0 x4 READ 3500MB/S WRITE 2100MB/S"," ",null,null,null,null,null,{"$f":"Tabelle491016[[#This Row],[Menge\n    *)]]*-1","v":0},null,null,null,{"$f":"Tabelle491016[[#This Row],[Menge\n    *)]]*-1","v":0},null,{"$f":"Tabelle491016[[#This Row],[Menge\n    *)]]*-1","v":0}]
[null,null,null,null,"Raid Controller",{"$f":"SUM(F83:F87)","v":0}]
[null,null,null,null,"653G7004",0,"GRAFENTHAL MEGARAID 9341-4i CONTROLLER","SATA 6GB/S SAS 12GB/S PCIe 3.0 x8","RAID 0 1 5 10 50 TYP 9341-4I",null,null,null,"X",{"$f":"Tabelle491016[[#This Row],[Menge\n    *)]]*-1","v":0},{"$f":"Tabelle491016[[#This Row],[Menge\n    *)]]*-1","v":0},{"$f":"Tabelle491016[[#This Row],[Menge\n    *)]]*-1","v":0},{"$f":"Tabelle491016[[#This Row],[Menge\n    *)]]*-1","v":0},"X","X",{"$f":"Tabelle491016[[#This Row],[Menge\n    *)]]*4","v":0},"X","X","X"]
[null,null,null,null,"653G5004",0,"GRAFENTHAL RAID CONTROLLER SAS/SATA","12Gb/s/6GB/s 4i 1GB CACHE PCIe 3.0 x8","RAID 0 1 5 6 10 50 60 TYP 9361-4I","X","X","X","X",{"$f":"Tabelle491016[[#This Row],[Menge\n    *)]]*-1","v":0},{"$f":"Tabelle491016[[#This Row],[Menge\n    *)]]*-1","v":0},{"$f":"Tabelle491016[[#This Row],[Menge\n    *)]]*-1","v":0},{"$f":"Tabelle491016[[#This Row],[Menge\n    *)]]*-1","v":0},"X","X",{"$f":"Tabelle491016[[#This Row],[Menge\n    *)]]*4","v":0},"X",{"$f":"Tabelle491016[[#This Row],[Menge\n    *)]]*1","v":0},{"$f":"Tabelle491016[[#This Row],[Menge\n    *)]]*1","v":0},"X","X"]
[null,null,null,null,"658G6006",0,"GRAFENTHAL CABLE MINI SAS HD TO","MINI SAS HD"," "]
[null,null,null,null,"653G7001",0,"GRAFENTHAL MEGARAID CACHECADE PRO 2.0","PHYSICAL KEY SSD CACHE ENABLER"," ","X","X","X","X","X","X","X","X","X","X","X","X",{"$f":"Tabelle491016[[#This Row],[Menge\n    *)]]*-1","v":0},"X","X","X"]
[null,null,null,null,"653G5903",0,"GRAFENTHAL CACHEVAULT FLASH CACHE","PROTECTION MODULE FOR RAID CTR"," ",null,null,null,null,null,null,null,null,null,null,null,null,null,{"$f":"Tabelle491016[[#This Row],[Menge\n    *)]]*-1","v":0}]
[null,null,null,null,"(Kupfer-) Netzkarte",{"$f":"SUM(F89:F90)","v":0}]
[null,null,null,null,"653G7002",0,"GRAFENTHAL ETHERNET ADAPTER DUAL PORT","RJ45 2x10GBE X550-T2 PCIe 3.0 x4"," ",null,null,null,null,{"$f":"Tabelle491016[[#This Row],[Menge\n    *)]]*-1","v":0},{"$f":"Tabelle491016[[#This Row],[Menge\n    *)]]*-1","v":0},{"$f":"Tabelle491016[[#This Row],[Menge\n    *)]]*-1","v":0}]
[null,null,null,null,"659G8015",0,"GRAFENTHAL GIGABIT ETHERNET APDATER","I350-T4V2 4x RJ-45 PCIe x4 COPPER"," ","X","X","X","X",{"$f":"Tabelle491016[[#This Row],[Menge\n    *)]]*-1","v":0},{"$f":"Tabelle491016[[#This Row],[Menge\n    *)]]*-1","v":0},{"$f":"Tabelle491016[[#This Row],[Menge\n    *)]]*-1","v":0},"X","X","X","X","X","X","X","X","X"]
[null,null,null,null,"(SFP+)Netzwerkkarte",{"$f":"SUM(F92:F93)","v":0}]
[null,null,null,null,"653G7003",0,"GRAFENTHAL ETHERNET ADAPTER 2-PORT 10GBE","INTEL X520 FIBRE SFP+ PCIe x8 LP"," ",null,null,null,null,{"$f":"Tabelle491016[[#This Row],[Menge\n    *)]]*-1","v":0},{"$f":"Tabelle491016[[#This Row],[Menge\n    *)]]*-1","v":0},{"$f":"Tabelle491016[[#This Row],[Menge\n    *)]]*-1","v":0}]
[null,null,null,null,"653G7000",0,"GRAFENTHAL ETHERNET ADAPTER DUAL PORT","QSFP+ 2x10GBE/40GBE PCIe 3.0 x8 XL710-QD"," ",null,null,null,null,{"$f":"Tabelle491016[[#This Row],[Menge\n    *)]]*-1","v":0},{"$f":"Tabelle491016[[#This Row],[Menge\n    *)]]*-1","v":0},{"$f":"Tabelle491016[[#This Row],[Menge\n    *)]]*-1","v":0}]
[null,null,null,null,"Glasfaserkarten",{"$f":"SUM(F95:F96)","v":0}]
[null,null,null,null,"659G7000",0,"GRAFENTHAL QLOGIC HBA FC SINGLE PORT","16GB/S PCIe 3.0 x8"," ","X","X","X","X",{"$f":"Tabelle491016[[#This Row],[Menge\n    *)]]*-1","v":0},{"$f":"Tabelle491016[[#This Row],[Menge\n    *)]]*-1","v":0},{"$f":"Tabelle491016[[#This Row],[Menge\n    *)]]*-1","v":0},"X","X","X","X","X","X","X","X","X"]
[null,null,null,null,"659G7001",0,"GRAFENTHAL QLOGIC HBA FC DUAL PORT","16GB/S PCIe 3.0 x8"," ","X","X","X","X",{"$f":"Tabelle491016[[#This Row],[Menge\n    *)]]*-1","v":0},{"$f":"Tabelle491016[[#This Row],[Menge\n    *)]]*-1","v":0},{"$f":"Tabelle491016[[#This Row],[Menge\n    *)]]*-1","v":0},"X","X","X","X","X","X","X","X","X"]
[null,null,null,null,"Grafikkarte",{"$f":"SUM(F98:F105)","v":0}]
[null,null,null,null,"659G8003",0,"GRAFENTHAL GPU NVIDIA QUADRO P400 256C","2GB GDDR5 32GB/S 30W PCI-E 3.0 x16"," ","X","X","X","X",{"$f":"Tabelle491016[[#This Row],[Menge\n    *)]]*-1","v":0},{"$f":"Tabelle491016[[#This Row],[Menge\n    *)]]*-1","v":0},{"$f":"Tabelle491016[[#This Row],[Menge\n    *)]]*-1","v":0},{"$f":"Tabelle491016[[#This Row],[Menge\n    *)]]*-1","v":0},"X","X","X","X","X","X","X","X"]
[null,null,null,null,"659G8004",0,"GRAFENTHAL GPU NVIDIA QUADRO P600 384C","2GB GDDR5 64GB/S 40W PCI-E 3.0 x16"," ","X","X","X","X",{"$f":"Tabelle491016[[#This Row],[Menge\n    *)]]*-1","v":0},{"$f":"Tabelle491016[[#This Row],[Menge\n    *)]]*-1","v":0},{"$f":"Tabelle491016[[#This Row],[Menge\n    *)]]*-1","v":0},{"$f":"Tabelle491016[[#This Row],[Menge\n    *)]]*-1","v":0},"X","X","X","X","X","X","X","X"]
[null,null,null,null,"659G8005",0,"GRAFENTHAL GPU NVIDIA QUADRO P1000 640C","4GB GDDR5 82GB/S 47W PCI-E 3.0 x16"," ","X","X","X","X",{"$f":"Tabelle491016[[#This Row],[Menge\n    *)]]*-1","v":0},{"$f":"Tabelle491016[[#This Row],[Menge\n    *)]]*-1","v":0},{"$f":"Tabelle491016[[#This Row],[Menge\n    *)]]*-1","v":0},{"$f":"Tabelle491016[[#This Row],[Menge\n    *)]]*-1","v":0},"X","X","X","X","X","X","X","X"]
[null,null,null,null,"659G8006",0,"GRAFENTHAL GPU NVIDIA QUADRO P2000 1024C","5GB GDDR5 140GB/S 75W PCI-E 3.0 x16"," ","X","X","X","X",{"$f":"Tabelle491016[[#This Row],[Menge\n    *)]]*-1","v":0},{"$f":"Tabelle491016[[#This Row],[Menge\n    *)]]*-1","v":0},{"$f":"Tabelle491016[[#This Row],[Menge\n    *)]]*-1","v":0},{"$f":"Tabelle491016[[#This Row],[Menge\n    *)]]*-1","v":0},"X","X","X","X","X","X","X","X"]
[null,null,null,null,"659G8007",0,"GRAFENTHAL GPU NVIDIA QUADRO P4000 1792C","8GB GDDR5 243GB/S 105W PCI-E 3.0 x16"," ","X","X","X","X",{"$f":"Tabelle491016[[#This Row],[Menge\n    *)]]*-1","v":0},{"$f":"Tabelle491016[[#This Row],[Menge\n    *)]]*-1","v":0},{"$f":"Tabelle491016[[#This Row],[Menge\n    *)]]*-1","v":0},{"$f":"Tabelle491016[[#This Row],[Menge\n    *)]]*-1","v":0},"X","X","X","X","X","X","X","X"]
[null,null,null,null,"659G8008",0,"GRAFENTHAL GPU NVIDIA QUADRO P5000 2560C","16GB GDDR5 288GB/S 180W PCI-E 3.0 x16"," ","X","X","X","X",{"$f":"Tabelle491016[[#This Row],[Menge\n    *)]]*-1","v":0},{"$f":"Tabelle491016[[#This Row],[Menge\n    *)]]*-1","v":0},{"$f":"Tabelle491016[[#This Row],[Menge\n    *)]]*-1","v":0},{"$f":"Tabelle491016[[#This Row],[Menge\n    *)]]*-1","v":0},"X","X","X","X","X","X","X","X"]
[null,null,null,null,"659G8009",0,"GRAFENTHAL GPU NVIDIA QUADRO P6000 3480C","24GB GDDR5 432GB/S 250W PCI-E 3.0 x16"," ","X","X","X","X",{"$f":"Tabelle491016[[#This Row],[Menge\n    *)]]*-1","v":0},{"$f":"Tabelle491016[[#This Row],[Menge\n    *)]]*-1","v":0},{"$f":"Tabelle491016[[#This Row],[Menge\n    *)]]*-1","v":0},{"$f":"Tabelle491016[[#This Row],[Menge\n    *)]]*-1","v":0},"X","X","X","X","X","X","X","X"]
[null,null,null,null,"659G8010",0,"GRAFENTHAL GPU NVIDIA QUADRO GP100 3584C","16GB HBM2 717GB/S 235W PCI-E 3.0 x16"," ","X","X","X","X",{"$f":"Tabelle491016[[#This Row],[Menge\n    *)]]*-1","v":0},{"$f":"Tabelle491016[[#This Row],[Menge\n    *)]]*-1","v":0},{"$f":"Tabelle491016[[#This Row],[Menge\n    *)]]*-1","v":0},{"$f":"Tabelle491016[[#This Row],[Menge\n    *)]]*-1","v":0},"X","X","X","X","X","X","X","X"]
[null,null,null,null,"Tower to Rack",{"$f":"SUM(F107)","v":0}]
[null,null,null,null,"659G6018",0,"GRAFENTHAL TOWER TO RACK KIT","FOR T2910 S2 AND W2910 S2"," ",null,null,null,null,null,null,null,null,null,null,null,"X"]
[null,null,null,null,"MPAC",{"$f":"SUM(F109:F144)","v":0}]
[null,null,null,null,"740M6157",0,"GRAFENTHAL MPAC VOR ORT SERVICE UPGRADE","3 JAHRE 13x5 24STD WIEDERHERSTELLUNG","FÜR T2910 S2 BIS E5-264X","X","X","X","X","X","X","X","X","X","X","X","X","X","X","X","X"]
[null,null,null,null,"740M6158",0,"GRAFENTHAL MPAC VOR ORT SERVICE UPGRADE","3 JAHRE 13x5 12STD WIEDERHERSTELLUNG","FÜR T2910 S2 BIS E5-264X","X","X","X","X","X","X","X","X","X","X","X","X","X","X","X","X"]
[null,null,null,null,"740M6159",0,"GRAFENTHAL MPAC VOR ORT SERVICE UPGRADE","3 JAHRE 24x7 6STD WIEDERHERSTELLUNG","FÜR T2910 S2 BIS E5-264X","X","X","X","X","X","X","X","X","X","X","X","X","X","X","X","X"]
[null,null,null,null,"740M6160",0,"GRAFENTHAL MPAC VOR ORT SERVICE UPGRADE","4 JAHRE 13x5 24STD WIEDERHERSTELLUNG","FÜR T2910 S2 BIS E5-264X","X","X","X","X","X","X","X","X","X","X","X","X","X","X","X","X"]
[null,null,null,null,"740M6161",0,"GRAFENTHAL MPAC VOR ORT SERVICE UPGRADE","4 JAHRE 13x5 12STD WIEDERHERSTELLUNG","FÜR T2910 S2 BIS E5-264X","X","X","X","X","X","X","X","X","X","X","X","X","X","X","X","X"]
[null,null,null,null,"740M6162",0,"GRAFENTHAL MPAC VOR ORT SERVICE UPGRADE","4 JAHRE 24x7 6STD WIEDERHERSTELLUNG","FÜR T2910 S2 BIS E5-264X","X","X","X","X","X","X","X","X","X","X","X","X","X","X","X","X"]
[null,null,null,null,"740M6163",0,"GRAFENTHAL MPAC VOR ORT SERVICE UPGRADE","5 JAHRE 13x5 24STD WIEDERHERSTELLUNG","FÜR T2910 S2 BIS E5-264X","X","X","X","X","X","X","X","X","X","X","X","X","X","X","X","X"]
[null,null,null,null,"740M6164",0,"GRAFENTHAL MPAC VOR ORT SERVICE UPGRADE","5 JAHRE 13x5 12STD WIEDERHERSTELLUNG","FÜR T2910 S2 BIS E5-264X","X","X","X","X","X","X","X","X","X","X","X","X","X","X","X","X"]
[null,null,null,null,"740M6165",0,"GRAFENTHAL MPAC VOR ORT SERVICE UPGRADE","5 JAHRE 24x7 6STD WIEDERHERSTELLUNG","FÜR T2910 S2 BIS E5-264X","X","X","X","X","X","X","X","X","X","X","X","X","X","X","X","X"]
[null,null,null,null,"740M6166",0,"GRAFENTHAL MPAC VOR ORT SERVICE UPGRADE","3 JAHRE 13x5 24STD WIEDERHERSTELLUNG","FÜR T2910 S2 AB E5-2650","X","X","X","X","X","X","X","X","X","X","X","X","X","X","X","X"]
[null,null,null,null,"740M6167",0,"GRAFENTHAL MPAC VOR ORT SERVICE UPGRADE","3 JAHRE 13x5 12STD WIEDERHERSTELLUNG","FÜR T2910 S2 AB E5-2650","X","X","X","X","X","X","X","X","X","X","X","X","X","X","X","X"]
[null,null,null,null,"740M6168",0,"GRAFENTHAL MPAC VOR ORT SERVICE UPGRADE","3 JAHRE 24x7 6STD WIEDERHERSTELLUNG","FÜR T2910 S2 AB E5-2650","X","X","X","X","X","X","X","X","X","X","X","X","X","X","X","X"]
[null,null,null,null,"740M6169",0,"GRAFENTHAL MPAC VOR ORT SERVICE UPGRADE","4 JAHRE 13x5 24STD WIEDERHERSTELLUNG","FÜR T2910 S2 AB E5-2650","X","X","X","X","X","X","X","X","X","X","X","X","X","X","X","X"]
[null,null,null,null,"740M6170",0,"GRAFENTHAL MPAC VOR ORT SERVICE UPGRADE","4 JAHRE 13x5 12STD WIEDERHERSTELLUNG","FÜR T2910 S2 AB E5-2650","X","X","X","X","X","X","X","X","X","X","X","X","X","X","X","X"]
[null,null,null,null,"740M6171",0,"GRAFENTHAL MPAC VOR ORT SERVICE UPGRADE","4 JAHRE 24x7 6STD WIEDERHERSTELLUNG","FÜR T2910 S2 AB E5-2650","X","X","X","X","X","X","X","X","X","X","X","X","X","X","X","X"]
[null,null,null,null,"740M6172",0,"GRAFENTHAL MPAC VOR ORT SERVICE UPGRADE","5 JAHRE 13x5 24STD WIEDERHERSTELLUNG","FÜR T2910 S2 AB E5-2650","X","X","X","X","X","X","X","X","X","X","X","X","X","X","X","X"]
[null,null,null,null,"740M6173",0,"GRAFENTHAL MPAC VOR ORT SERVICE UPGRADE","5 JAHRE 13x5 12STD WIEDERHERSTELLUNG","FÜR T2910 S2 AB E5-2650","X","X","X","X","X","X","X","X","X","X","X","X","X","X","X","X"]
[null,null,null,null,"740M6174",0,"GRAFENTHAL MPAC VOR ORT SERVICE UPGRADE","5 JAHRE 24x7 6STD WIEDERHERSTELLUNG","FÜR T2910 S2 AB E5-2650","X","X","X","X","X","X","X","X","X","X","X","X","X","X","X","X"]
[null,null,null,null,"740M6175",0,"GRAFENTHAL MPAC VOR ORT SERVICE UPGRADE","3 JAHRE 13x5 24STD WIEDERHERSTELLUNG DMR","FÜR T2910 S2 BIS E5-264X","X","X","X","X","X","X","X","X","X","X","X","X","X","X","X","X"]
[null,null,null,null,"740M6176",0,"GRAFENTHAL MPAC VOR ORT SERVICE UPGRADE","3 JAHRE 13x5 12STD WIEDERHERSTELLUNG DMR","FÜR T2910 S2 BIS E5-264X","X","X","X","X","X","X","X","X","X","X","X","X","X","X","X","X"]
[null,null,null,null,"740M6177",0,"GRAFENTHAL MPAC VOR ORT SERVICE UPGRADE","3 JAHRE 24x7 6STD WIEDERHERSTELLUNG DMR","FÜR T2910 S2 BIS E5-264X","X","X","X","X","X","X","X","X","X","X","X","X","X","X","X","X"]
[null,null,null,null,"740M6178",0,"GRAFENTHAL MPAC VOR ORT SERVICE UPGRADE","4 JAHRE 13x5 24STD WIEDERHERSTELLUNG DMR","FÜR T2910 S2 BIS E5-264X","X","X","X","X","X","X","X","X","X","X","X","X","X","X","X","X"]
[null,null,null,null,"740M6179",0,"GRAFENTHAL MPAC VOR ORT SERVICE UPGRADE","4 JAHRE 13x5 12STD WIEDERHERSTELLUNG DMR","FÜR T2910 S2 BIS E5-264X","X","X","X","X","X","X","X","X","X","X","X","X","X","X","X","X"]
[null,null,null,null,"740M6180",0,"GRAFENTHAL MPAC VOR ORT SERVICE UPGRADE","4 JAHRE 24x7 6STD WIEDERHERSTELLUNG DMR","FÜR T2910 S2 BIS E5-264X","X","X","X","X","X","X","X","X","X","X","X","X","X","X","X","X"]
[null,null,null,null,"740M6181",0,"GRAFENTHAL MPAC VOR ORT SERVICE UPGRADE","5 JAHRE 13x5 24STD WIEDERHERSTELLUNG DMR","FÜR T2910 S2 BIS E5-264X","X","X","X","X","X","X","X","X","X","X","X","X","X","X","X","X"]
[null,null,null,null,"740M6182",0,"GRAFENTHAL MPAC VOR ORT SERVICE UPGRADE","5 JAHRE 13x5 12STD WIEDERHERSTELLUNG DMR","FÜR T2910 S2 BIS E5-264X","X","X","X","X","X","X","X","X","X","X","X","X","X","X","X","X"]
[null,null,null,null,"740M6183",0,"GRAFENTHAL MPAC VOR ORT SERVICE UPGRADE","5 JAHRE 24x7 6STD WIEDERHERSTELLUNG DMR","FÜR T2910 S2 BIS E5-264X","X","X","X","X","X","X","X","X","X","X","X","X","X","X","X","X"]
[null,null,null,null,"740M6184",0,"GRAFENTHAL MPAC VOR ORT SERVICE UPGRADE","3 JAHRE 13x5 24STD WIEDERHERSTELLUNG DMR","FÜR T2910 S2 AB E5-2650","X","X","X","X","X","X","X","X","X","X","X","X","X","X","X","X"]
[null,null,null,null,"740M6185",0,"GRAFENTHAL MPAC VOR ORT SERVICE UPGRADE","3 JAHRE 13x5 12STD WIEDERHERSTELLUNG DMR","FÜR T2910 S2 AB E5-2650","X","X","X","X","X","X","X","X","X","X","X","X","X","X","X","X"]
[null,null,null,null,"740M6186",0,"GRAFENTHAL MPAC VOR ORT SERVICE UPGRADE","3 JAHRE 24x7 6STD WIEDERHERSTELLUNG DMR","FÜR T2910 S2 AB E5-2650","X","X","X","X","X","X","X","X","X","X","X","X","X","X","X","X"]
[null,null,null,null,"740M6187",0,"GRAFENTHAL MPAC VOR ORT SERVICE UPGRADE","4 JAHRE 13x5 24STD WIEDERHERSTELLUNG DMR","FÜR T2910 S2 AB E5-2650","X","X","X","X","X","X","X","X","X","X","X","X","X","X","X","X"]
[null,null,null,null,"740M6188",0,"GRAFENTHAL MPAC VOR ORT SERVICE UPGRADE","4 JAHRE 13x5 12STD WIEDERHERSTELLUNG DMR","FÜR T2910 S2 AB E5-2650","X","X","X","X","X","X","X","X","X","X","X","X","X","X","X","X"]
[null,null,null,null,"740M6189",0,"GRAFENTHAL MPAC VOR ORT SERVICE UPGRADE","4 JAHRE 24x7 6STD WIEDERHERSTELLUNG DMR","FÜR T2910 S2 AB E5-2650","X","X","X","X","X","X","X","X","X","X","X","X","X","X","X","X"]
[null,null,null,null,"740M6190",0,"GRAFENTHAL MPAC VOR ORT SERVICE UPGRADE","5 JAHRE 13x5 24STD WIEDERHERSTELLUNG DMR","FÜR T2910 S2 AB E5-2650","X","X","X","X","X","X","X","X","X","X","X","X","X","X","X","X"]
[null,null,null,null,"740M6191",0,"GRAFENTHAL MPAC VOR ORT SERVICE UPGRADE","5 JAHRE 13x5 12STD WIEDERHERSTELLUNG DMR","FÜR T2910 S2 AB E5-2650","X","X","X","X","X","X","X","X","X","X","X","X","X","X","X","X"]
[null,null,null,null,"740M6192",0,"GRAFENTHAL MPAC VOR ORT SERVICE UPGRADE","5 JAHRE 24x7 6STD WIEDERHERSTELLUNG DMR","FÜR T2910 S2 AB E5-2650","X","X","X","X","X","X","X","X","X","X","X","X","X","X","X","X"]
[null,null,null,null,"CONFIG-TO-ORDER",{"$f":"SUM(F146:F149)","v":0}]
[null,null,null,null,"CTO",0,"HARDWARE ASSEMBLIERUNG",null,null,"X","X","X","X","X","X","X","X","X","X","X","X","X","X","X","X"]
[null,null,null,null,"CTO1",0,"HARDWARE ASSEMBLIERUNG & FIRMWARE UPDATE",null,null,"X","X","X","X","X","X","X","X","X","X","X","X","X","X","X","X"]
[null,null,null,null,"CTO2",0,"HARDWARE ASSEMBLIERUNG, FIRMWARE UPDATE & RAID EINRICHTUNG",null,null,"X","X","X","X","X","X","X","X","X","X","X","X","X","X","X","X"]
[null,null,null,null,"CTO3",0,"HARDWARE ASSEMBLIERUNG, FIRMWARE UPDATE, RAID EINRICHTUNG & OS INSTALLATION",null,null,"X","X","X","X","X","X","X","X","X","X","X","X","X","X","X","X"]
[null,null,null,null,"USB Drive",{"$f":"SUM(F151:F152)","v":0},"*EXTERNER ANSCHLUSS*"]
[null,null,null,null,"652G6004",0,"GRAFENTHAL USB 3.0 FLASH DRIVE","ULTRA FIT 64GB UP TO 150MB/S"," ","X","X","X","X","X","X","X","X","X","X","X","X","X","X","X","X"]
[null,null,null,null,"652G6005",0,"GRAFENTHAL USB 3.0 FLASH DRIVE","ULTRA FIT 128GB UP TO 150MB/S"," ","X","X","X","X","X","X","X","X","X","X","X","X","X","X","X","X"]
[null,null,null,null,"USV- Systeme",{"$f":"SUM(F154:F157)","v":0}]
[null,null,null,null,"132G0150",0,"GRAFENTHAL USV ETR-1500 TOWER RACK LINE","INTERACTIVE 1500VA 1200W PURE SINEWAVE","ECO MODE 23KG CE ROHS GERMAN","X","X","X","X","X","X","X","X","X","X","X","X","X","X","X","X"]
[null,null,null,null,"132G0300",0,"GRAFENTHAL USV ETR-3000 TOWER RACK LINE","INTERACTIVE 3000VA 2400W PURE SINEWAVE","ECO MODE 35KG CE ROHS GERMAN","X","X","X","X","X","X","X","X","X","X","X","X","X","X","X","X"]
[null,null,null,null,"113G1150",0,"GRAFENTHAL USV PR-1500-HS PROGRAMMABLE","ECO MODE RACK MOUNT 2U USB RS232 LCD"," ","X","X","X","X","X","X","X","X","X","X","X","X","X","X","X","X"]
[null,null,null,null,"113G1300",0,"GRAFENTHAL USV PR-3000-HS ONLINE","ECO MODE RACK MOUNT 2U USB RS232 LCD"," ","X","X","X","X","X","X","X","X","X","X","X","X","X","X","X","X"]
[null,null,null,null,"USV- Zubehör",{"$f":"SUM(F159:F160)","v":0}]
[null,null,null,null,"149G6005",0,"GRAFENTHAL USV SNMP CARD PRO S2","FOR ETR AND PR AND PTR SERIES","MULTI SERVER SHUTDOWN","X","X","X","X","X","X","X","X","X","X","X","X","X","X","X","X"]
[null,null,null,null,"149G5003",0,"GRAFENTHAL USV ACCESSORY LICENSE FOR","SNMP PRO CARD FOR ETR AND PR SERIES","MULTI SERVER SHUTDOWN","X","X","X","X","X","X","X","X","X","X","X","X","X","X","X","X"]
[null,null,null,null,"SUMME",1,null,null,null,{"$f":"COUNTIF($J$162:$Y$162,\"<0\")","v":0}]
[null,null,null,null,null,null,null,null,null,{"$f":"SUM(J14:J160)","v":0},{"$f":"SUM(K14:K160)","v":0},{"$f":"SUM(L14:L160)","v":0},{"$f":"SUM(M14:M160)","v":0},0,0,0,0,0,0,0,0,0,{"$f":"SUM(W14:W160)","v":0},{"$f":"SUM(X14:X160)","v":0},{"$f":"SUM(Y14:Y160)","v":0}]

{"sheet":"NUC S3","index":14,"n_rows":40,"n_cols":15,"rows_kept":40,"cut":false,"hidden":false,"merged":[[0,4,0,8],[1,12,9,14]]}
[null,null,null,null,"NUC S3"]
[]
[null,null,null,null,null,null,null,"Intel® Core™ i3-7100U ","more info"]
[null,null,null,null,null,null,null,"M.2 High Speed SSD Slot"]
[null,null,null,null,null,null,null,"Multi Monitor fähig"]
[null,null,null,null,null,null,null,"WLAN nach 802.11ac Standard"]
[null,null,null,null,null,null,null,"mechanisch wartungsfrei"]
[null,null,null,null,null,null,null,null,"*) :  \"Menge\" filtern um Konfiguration anzuzeigen"]
[null,null,null,null,null,null,null,null,"* Felder werden automatisch ausgefüllt"]
[]
[null,null,null,null,"Konfigurator",null,{"$f":"'Revision Info'!B10","v":"Revision 15"}]
[null,null,null,null,"ART. NR.","Menge\n     *)","Bezeichnung","Bezeichnung II","Bezeichnung III","nicht kombinierbar","nicht konfigurierbar","MEM Slots","Int. M.2 Slot","Int. SATA Slot (SSD / HDD)","sonst."]
[null,null,null,null,"Maschinentyp",{"$f":"SUM(F14:F14)","v":0},null,null,null,"if (Kombi);-1;0","if Menge;-1;0","(Menge x Eigenschaft)","(Menge x Eigenschaft)","(Menge x Eigenschaft)","(Menge x Eigenschaft)"]
[null,null,null,null,"731G7001",0,"GRAFENTHAL NUC S3 CTO SYSTEM CORE"," I3-7100U 2xSO-DIMM SLOTS 1x M.2 FANLESS","USB 3.0 7.1 Audio HDMI WLAN BLUETOOTH",null,null,{"$f":"Tabelle4781517[[#This Row],[Menge\n     *)]]*2","v":0},{"$f":"Tabelle4781517[[#This Row],[Menge\n     *)]]*1","v":0},{"$f":"Tabelle4781517[[#This Row],[Menge\n     *)]]*1","v":0},{"$f":"Tabelle4781517[[#This Row],[Menge\n     *)]]*0","v":0}]
[null,null,null,null,"Arbeitsspeicher",{"$f":"SUM(F16:F18)","v":0}]
[null,null,null,null,"752G8001",0,"GRAFENTHAL MEM 4GB DDR4-2400MHz SODIMM","PC4-19200 CL17 SINGLE RANKED NON-ECC"," ",null,null,{"$f":"Tabelle4781517[[#This Row],[Menge\n     *)]]*-1","v":0},"X","X","X"]
[null,null,null,null,"752G8002",0,"GRAFENTHAL MEM 8GB DDR4-2400MHz SODIMM","PC4-19200 CL17 DUAL RANKED NON-ECC"," ",null,null,{"$f":"Tabelle4781517[[#This Row],[Menge\n     *)]]*-1","v":0},"X","X","X"]
[null,null,null,null,"752G8003",0,"GRAFENTHAL MEM 16GB DDR4 2400MHz SODIMM","PC4-19200 CL17 DUAL RANKED NON-ECC"," ",null,null,{"$f":"Tabelle4781517[[#This Row],[Menge\n     *)]]*-1","v":0},"X","X","X"]
[null,null,null,null,"Festplatten",{"$f":"SUM(F20,F24,F28)","v":0}]
[null,null,null,null,"SATA M.2 SSD",{"$f":"SUM(F21:F23)","v":0}]
[null,null,null,null,"651G8000",0,"GRAFENTHAL SSD 256GB M.2 2280 SATA 6GB/S","256BIT-AES MTBF 1.6M HOURS TBW 144TB"," ",null,null,"X",{"$f":"Tabelle4781517[[#This Row],[Menge\n     *)]]*-1","v":0},"X","X"]
[null,null,null,null,"651G8001",0,"GRAFENTHAL SSD 512GB M.2 2280 SATA 6GB/S","256BIT-AES MTBF 1.6M HOURS TBW 288TB"," ",null,null,"X",{"$f":"Tabelle4781517[[#This Row],[Menge\n     *)]]*-1","v":0},"X","X"]
[null,null,null,null,"651G8002",0,"GRAFENTHAL SSD 1TB M.2 2280 SATA 6GB/S","256BIT-AES TCG OPAL 2.0 MTBF 1.5M HOURS"," ",null,null,"X",{"$f":"Tabelle4781517[[#This Row],[Menge\n     *)]]*-1","v":0},"X","X"]
[null,null,null,null,"SATA SSD 6GB/s *ENTRY*",{"$f":"SUM(F25:F27)","v":0}]
[null,null,null,null,"651G6048",0,"GRAFENTHAL SSD 256GB 2,5'' SATA 6GB/S","ENTRY CLASS SSD DWPD 0,35","READ INTENSIVE AND BOOT APPLICATION",null,null,"X","X",{"$f":"Tabelle4781517[[#This Row],[Menge\n     *)]]*-1","v":0},"X"]
[null,null,null,null,"651G6049",0,"GRAFENTHAL SSD 512GB 2,5'' SATA 6GB/S","ENTRY CLASS SSD DWPD 0,35","READ INTENSIVE AND BOOT APPLICATION",null,null,"X","X",{"$f":"Tabelle4781517[[#This Row],[Menge\n     *)]]*-1","v":0},"X"]
[null,null,null,null,"651G6050",0,"GRAFENTHAL SSD 1 TB  2,5'' SATA 6GB/S","ENTRY CLASS SSD DWPD 0,35","READ INTENSIVE AND BOOT APPLICATION",null,null,"X","X",{"$f":"Tabelle4781517[[#This Row],[Menge\n     *)]]*-1","v":0},"X"]
[null,null,null,null,"SATA HDD 6GB/s",{"$f":"SUM(F29:F31)","v":0}]
[null,null,null,null,"651G6002",0,"GRAFENTHAL HDD 1TB 2,5'' SATA 7200RPM","32MB CACHE 6GB/S BAUHÖHE 9.5MM","FUER SERVER UND WORKSTATION",null,null,"X","X",{"$f":"Tabelle4781517[[#This Row],[Menge\n     *)]]*-1","v":0},"X"]
[null,null,null,null,"651G6039",0,"GRAFENTHAL HDD 500GB 2.5'' SATA","7200RPM 6GB/S"," ",null,null,"X","X",{"$f":"Tabelle4781517[[#This Row],[Menge\n     *)]]*-1","v":0},"X"]
[null,null,null,null,"651G6040",0,"GRAFENTHAL HDD 1000GB 2.5'' SATA","7200RPM 6GB/S"," ",null,null,"X","X",{"$f":"Tabelle4781517[[#This Row],[Menge\n     *)]]*-1","v":0},"X"]
[null,null,null,null,"CONFIG-TO-ORDER",{"$f":"SUM(F33:F36)","v":0}]
[null,null,null,null,"CTO",0,"HARDWARE ASSEMBLIERUNG",null,null,null,null,"X","X","X","X"]
[null,null,null,null,"CTO1",0,"HARDWARE ASSEMBLIERUNG & FIRMWARE UPDATE",null,null,null,null,"X","X","X","X"]
[null,null,null,null,"CTO2",0,"HARDWARE ASSEMBLIERUNG, FIRMWARE UPDATE & RAID EINRICHTUNG",null,null,null,null,"X","X","X","X"]
[null,null,null,null,"CTO3",0,"HARDWARE ASSEMBLIERUNG, FIRMWARE UPDATE, RAID EINRICHTUNG & OS INSTALLATION",null,null,null,null,"X","X","X","X"]
[null,null,null,null,"Maus/ Tastatur",{"$f":"SUM(F38:F38)","v":0}]
[null,null,null,null,"759G7000",0,"GRAFENTHAL KEYBOARD AND MOUSE SET USB","GERMAN FOR DAVIDE PC"," ",null,null,"X","X","X","X"]
[null,null,null,null,"SUMME",1,null,null,null,{"$f":"COUNTIF($J$40:$O$40,\"<0\")","v":0}]
[null,null,null,null,null,null,null,null,null,{"$f":"SUM(J14:J38)","v":0},0,{"$f":"SUM(L14:L38)","v":0},{"$f":"SUM(M14:M38)","v":0},{"$f":"SUM(N14:N38)","v":0},{"$f":"SUM(O14:O38)","v":0}]

{"sheet":"DAVIDE","index":15,"n_rows":35,"n_cols":15,"rows_kept":35,"cut":false,"hidden":false,"merged":[[0,4,0,8],[1,12,9,14]]}
[null,null,null,null,"DAVIDE"]
[]
[null,null,null,null,null,null,null,"Desktop-grade 7th Generation Intel Core i7, i5 or i3 processor","more info"]
[null,null,null,null,null,null,null,"with DDR4 RAM"]
[null,null,null,null,null,null,null,"4K UHD support via DisplayPort or HDMI, along with DVI output"]
[null,null,null,null,null,null,null,"Windows 10 Professional 64bit"]
[null,null,null,null,null,null,null,"VESA-mountable design"]
[null,null,null,null,null,null,null,"Compact 2-liter mini PC with a standard Mini- STX motherboard","*) \"Menge\" filtern um Konfiguration anzuzeigen"]
[null,null,null,null,null,null,null,null,"* Felder werden automatisch ausgefüllt"]
[]
[null,null,null,null,"Konfigurator",null,{"$f":"'Revision Info'!B10","v":"Revision 15"}]
[null,null,null,null,"ART. NR.","Menge\n     *)","Bezeichnung","Bezeichnung II","Bezeichnung III","nicht kombinierbar","nicht konfigurierbar","MEM Slots","SSD Slots","HDD Slots NHS SATA","Int HDD Slots"]
[null,null,null,null,"Maschinentyp",{"$f":"SUM(F14:F16)","v":0},null,null,null,"if (Kombi);-1;0","if Menge;-1;0","(Menge x Eigenschaft)","(Menge x Eigenschaft)","(Menge x Eigenschaft)","(Menge x Eigenschaft)"]
[null,null,null,null,"731G7002",0,"GRAFENTHAL DAVIDE MINI PC i3-7100 8GB","128GB M.2 SSD DVD WLAN BLUETOOTH VESA","SDARD SLOT USB 3.0 WIN10 PRO 64BIT",null,null,{"$f":"Tabelle47813[[#This Row],[Menge\n     *)]]*1","v":0},{"$f":"Tabelle47813[[#This Row],[Menge\n     *)]]*1","v":0},{"$f":"Tabelle47813[[#This Row],[Menge\n     *)]]*1","v":0},{"$f":"Tabelle47813[[#This Row],[Menge\n     *)]]*1","v":0}]
[null,null,null,null,"731G7003",0,"GRAFENTHAL DAVIDE MINI PC i5-7400 8GB","256GB SSD DVD WLAN AC BLUETOOTH VESA","SDARD SLOT USB 3.0 WIN10 PRO 64BIT",null,null,{"$f":"Tabelle47813[[#This Row],[Menge\n     *)]]*1","v":0},{"$f":"Tabelle47813[[#This Row],[Menge\n     *)]]*1","v":0},{"$f":"Tabelle47813[[#This Row],[Menge\n     *)]]*1","v":0},{"$f":"Tabelle47813[[#This Row],[Menge\n     *)]]*1","v":0}]
[null,null,null,null,"731G7005",0,"GRAFENTHAL DAVIDE MINI PC i7-7700 16GB","512GB SSD DVD LAN WLAN AC BLUETOOTH VESA","SDARD SLOT USB 3.0 WIN10 PRO 64BIT",null,null,{"$f":"Tabelle47813[[#This Row],[Menge\n     *)]]*1","v":0},{"$f":"Tabelle47813[[#This Row],[Menge\n     *)]]*1","v":0},{"$f":"Tabelle47813[[#This Row],[Menge\n     *)]]*1","v":0},{"$f":"Tabelle47813[[#This Row],[Menge\n     *)]]*1","v":0}]
[null,null,null,null,"Arbeitsspeicher",{"$f":"SUM(F19:F20)","v":0}]
[null,null,null,null,"752G8001",0,"GRAFENTHAL MEM 4GB DDR4-2400MHz SODIMM","PC4-19200 CL17 SINGLE RANKED NON-ECC"," ",null,null,{"$f":"Tabelle47813[[#This Row],[Menge\n     *)]]*-1","v":0},"X","X","X"]
[null,null,null,null,"752G8002",0,"GRAFENTHAL MEM 8GB DDR4-2400MHz SODIMM","PC4-19200 CL17 DUAL RANKED NON-ECC"," ",null,null,{"$f":"Tabelle47813[[#This Row],[Menge\n     *)]]*-1","v":0},"X","X","X"]
[null,null,null,null,"752G8003",0,"GRAFENTHAL MEM 16GB DDR4 2400MHz SODIMM","PC4-19200 CL17 DUAL RANKED NON-ECC"," ",null,null,{"$f":"Tabelle47813[[#This Row],[Menge\n     *)]]*-1","v":0},"X","X","X"]
[null,null,null,null,"Festplatten",{"$f":"SUM(F23:F26,F28:F29)","v":0}]
[null,null,null,null,"SATA 2,5\" SSD 6GB/s *ENTRY*",{"$f":"SUM(F23:F26)","v":0}]
[null,null,null,null,"651G8024",0,"GRAFENTHAL SSD 256GB SATA3 6GB/S 2.5''","MTBF 1.5M HOURS TBW 300TB"," ",null,null,"X",{"$f":"Tabelle47813[[#This Row],[Menge\n     *)]]*-1","v":0},"X",{"$f":"Tabelle47813[[#This Row],[Menge\n     *)]]*-1","v":0}]
[null,null,null,null,"651G8025",0,"GRAFENTHAL SSD 512GB SATA3 6GB/S 2.5''","MTBF 1.5M HOURS TBW 300TB"," ",null,null,"X",{"$f":"Tabelle47813[[#This Row],[Menge\n     *)]]*-1","v":0},"X",{"$f":"Tabelle47813[[#This Row],[Menge\n     *)]]*-1","v":0}]
[null,null,null,null,"651G8026",0,"GRAFENTHAL SSD 1TB SATA3 6GB/S 2.5''","MTBF 1.5M HOURS TBW 300TB"," ",null,null,"X",{"$f":"Tabelle47813[[#This Row],[Menge\n     *)]]*-1","v":0},"X",{"$f":"Tabelle47813[[#This Row],[Menge\n     *)]]*-1","v":0}]
[null,null,null,null,"651G8027",0,"GRAFENTHAL SSD 2TB SATA3 6GB/S 2.5''","MTBF 1.5M HOURS TBW 300TB"," ",null,null,"X",{"$f":"Tabelle47813[[#This Row],[Menge\n     *)]]*-1","v":0},"X",{"$f":"Tabelle47813[[#This Row],[Menge\n     *)]]*-1","v":0}]
[null,null,null,null,"SATA HDD 6GB/s",{"$f":"SUM(F28:F29)","v":0}]
[null,null,null,null,"651G6039",0,"GRAFENTHAL HDD 500GB 2.5'' SATA","7200RPM 6GB/S"," ",null,null,"X","X",{"$f":"Tabelle47813[[#This Row],[Menge\n     *)]]*-1","v":0},{"$f":"Tabelle47813[[#This Row],[Menge\n     *)]]*-1","v":0}]
[null,null,null,null,"651G6002",0,"GRAFENTHAL HDD 1TB 2,5'' SATA 7200RPM","32MB CACHE 6GB/S BAUHÖHE 9.5MM","FUER SERVER UND WORKSTATION",null,null,"X","X",{"$f":"Tabelle47813[[#This Row],[Menge\n     *)]]*-1","v":0},{"$f":"Tabelle47813[[#This Row],[Menge\n     *)]]*-1","v":0}]
[null,null,null,null,"CONFIG-TO-ORDER",{"$f":"SUM(F31:F31)","v":0}]
[null,null,null,null,"CTO",0,"HARDWARE ASSEMBLIERUNG",null,null,null,null,"X","X","X","X"]
[null,null,null,null,"Maus/ Tastatur"]
[null,null,null,null,"759G7000",1,"GRAFENTHAL KEYBOARD AND MOUSE SET USB","GERMAN FOR DAVIDE PC"," "]
[null,null,null,null,"SUMME",1,null,null,null,{"$f":"COUNTIF($J$35:$O$35,\"<0\")","v":0}]
[null,null,null,null,null,null,null,null,null,{"$f":"SUM(J14:J33)","v":0},0,{"$f":"SUM(L14:L33)","v":0},{"$f":"SUM(M14:M33)","v":0},{"$f":"SUM(N14:N33)","v":0},{"$f":"SUM(O14:O33)","v":0}]

{"sheet":"DAVIDE Tiny","index":16,"n_rows":34,"n_cols":15,"rows_kept":34,"cut":false,"hidden":false,"merged":[[0,4,0,8],[1,12,9,14]]}
[null,null,null,null,"DAVIDE Tiny"]
[]
[null,null,null,null,null,null,null,"Intel® Core™ Prozessoren der siebten Generation","more info"]
[null,null,null,null,null,null,null,"256GB M.2 High Speed SSD"]
[null,null,null,null,null,null,null,"Unterstützung von zwei Displays"]
[null,null,null,null,null,null,null,"WLAN und Bluetooth"]
[null,null,null,null,null,null,null,"Microsoft Windows 10 Professional 64 Bit"]
[null,null,null,null,null,null,null,null,"*) :  \"Menge\" filtern um Konfiguration anzuzeigen"]
[null,null,null,null,null,null,null,null,"* Felder werden automatisch ausgefüllt"]
[]
[null,null,null,null,"Konfigurator",null,{"$f":"'Revision Info'!B10","v":"Revision 15"}]
[null,null,null,null,"ART. NR.","Menge\n     *)","Bezeichnung","Bezeichnung II","Bezeichnung III","nicht kombinierbar","nicht konfigurierbar","MEM Slots","SSD Slots","HDD Slots NHS SATA","Int HDD Slots"]
[null,null,null,null,"Maschinentyp",{"$f":"SUM(F14:F15)","v":0},null,null,null,"if (Kombi);-1;0","if Menge;-1;0","(Menge x Eigenschaft)","(Menge x Eigenschaft)","(Menge x Eigenschaft)","(Menge x Eigenschaft)"]
[null,null,null,null,"731G8002",0,"GRAFENTHAL DAVIDE TINY PC i3-7100T","8GB 256GB GIGABIT LAN BT WLAN VESA","WIN10 PRO 64 BIT",null,null,{"$f":"Tabelle4781316[[#This Row],[Menge\n     *)]]*1","v":0},{"$f":"Tabelle4781316[[#This Row],[Menge\n     *)]]*1","v":0},{"$f":"Tabelle4781316[[#This Row],[Menge\n     *)]]*1","v":0},{"$f":"Tabelle4781316[[#This Row],[Menge\n     *)]]*1","v":0}]
[null,null,null,null,"731G8003",0,"GRAFENTHAL DAVIDE TINY PC i5-7400T","8GB 256GB GIGABIT LAN WLAN BT VESA","WIN10 PRO 64 BIT",null,null,{"$f":"Tabelle4781316[[#This Row],[Menge\n     *)]]*1","v":0},{"$f":"Tabelle4781316[[#This Row],[Menge\n     *)]]*1","v":0},{"$f":"Tabelle4781316[[#This Row],[Menge\n     *)]]*1","v":0},{"$f":"Tabelle4781316[[#This Row],[Menge\n     *)]]*1","v":0}]
[null,null,null,null,"Arbeitsspeicher",{"$f":"SUM(F18:F19)","v":0}]
[null,null,null,null,"752G8001",0,"GRAFENTHAL MEM 4GB DDR4-2400MHz SODIMM","PC4-19200 CL17 SINGLE RANKED NON-ECC"," ",null,null,{"$f":"Tabelle4781316[[#This Row],[Menge\n     *)]]*-1","v":0},"X","X","X"]
[null,null,null,null,"752G8002",0,"GRAFENTHAL MEM 8GB DDR4-2400MHz SODIMM","PC4-19200 CL17 DUAL RANKED NON-ECC"," ",null,null,{"$f":"Tabelle4781316[[#This Row],[Menge\n     *)]]*-1","v":0},"X","X","X"]
[null,null,null,null,"752G8003",0,"GRAFENTHAL MEM 16GB DDR4 2400MHz SODIMM","PC4-19200 CL17 DUAL RANKED NON-ECC"," ",null,null,{"$f":"Tabelle4781316[[#This Row],[Menge\n     *)]]*-1","v":0},"X","X","X"]
[null,null,null,null,"Festplatten",{"$f":"SUM(F22:F25,F27:F28)","v":0}]
[null,null,null,null,"SATA 2,5\" SSD 6GB/s *ENTRY*",{"$f":"SUM(F22:F25)","v":0}]
[null,null,null,null,"651G8024",0,"GRAFENTHAL SSD 256GB SATA3 6GB/S 2.5''","MTBF 1.5M HOURS TBW 300TB"," ",null,null,"X",{"$f":"Tabelle4781316[[#This Row],[Menge\n     *)]]*-1","v":0},"X",{"$f":"Tabelle4781316[[#This Row],[Menge\n     *)]]*-1","v":0}]
[null,null,null,null,"651G8025",0,"GRAFENTHAL SSD 512GB SATA3 6GB/S 2.5''","MTBF 1.5M HOURS TBW 300TB"," ",null,null,"X",{"$f":"Tabelle4781316[[#This Row],[Menge\n     *)]]*-1","v":0},"X",{"$f":"Tabelle4781316[[#This Row],[Menge\n     *)]]*-1","v":0}]
[null,null,null,null,"651G8026",0,"GRAFENTHAL SSD 1TB SATA3 6GB/S 2.5''","MTBF 1.5M HOURS TBW 300TB"," ",null,null,"X",{"$f":"Tabelle4781316[[#This Row],[Menge\n     *)]]*-1","v":0},"X",{"$f":"Tabelle4781316[[#This Row],[Menge\n     *)]]*-1","v":0}]
[null,null,null,null,"651G8027",0,"GRAFENTHAL SSD 2TB SATA3 6GB/S 2.5''","MTBF 1.5M HOURS TBW 300TB"," ",null,null,"X",{"$f":"Tabelle4781316[[#This Row],[Menge\n     *)]]*-1","v":0},"X",{"$f":"Tabelle4781316[[#This Row],[Menge\n     *)]]*-1","v":0}]
[null,null,null,null,"SATA HDD 6GB/s",{"$f":"SUM(F27:F28)","v":0}]
[null,null,null,null,"651G6039",0,"GRAFENTHAL HDD 500GB 2.5'' SATA","7200RPM 6GB/S"," ",null,null,"X",{"$f":"Tabelle4781316[[#This Row],[Menge\n     *)]]*-1","v":0},"X",{"$f":"Tabelle4781316[[#This Row],[Menge\n     *)]]*-1","v":0}]
[null,null,null,null,"651G6002",0,"GRAFENTHAL HDD 1TB 2,5'' SATA 7200RPM","32MB CACHE 6GB/S BAUHÖHE 9.5MM","FUER SERVER UND WORKSTATION",null,null,"X",{"$f":"Tabelle4781316[[#This Row],[Menge\n     *)]]*-1","v":0},"X",{"$f":"Tabelle4781316[[#This Row],[Menge\n     *)]]*-1","v":0}]
[null,null,null,null,"CONFIG-TO-ORDER",{"$f":"SUM(F30:F30)","v":0}]
[null,null,null,null,"CTO",0,"HARDWARE ASSEMBLIERUNG",null,null,null,null,"X","X","X","X"]
[null,null,null,null,"Maus/ Tastatur"]
[null,null,null,null,"759G7000",1,"GRAFENTHAL KEYBOARD AND MOUSE SET USB","GERMAN FOR DAVIDE PC"," "]
[null,null,null,null,"SUMME",1,null,null,null,{"$f":"COUNTIF($J$34:$O$34,\"<0\")","v":0}]
[null,null,null,null,null,null,null,null,null,{"$f":"SUM(J14:J32)","v":0},0,0,0,0,0]